program: Orca
programVersion: 5.0.2
elementType: O O O C C C C C C C C C C C C C C C C C C C C C C C H H H H H H H H H H H H H H H H H H H H H H H H H H
charge: 0
multiplicity: 1
keywords: wb97x-d3
keywords: def2-TZVPP
keywords: def2/J RIJCOSX
keywords: DEFGRID2
keywords: scfconv7
keywords: smallprint printgap noloewdin
keywords: NOSOSCF
formula: C23H26O3
InChI: InChI=1/C23H26O3/c1-16(2)13-20-21(23(20,3)4)22(24)25-15-17-9-8-12-19(14-17)26-18-10-6-5-7-11-18/h5-14,20-21H,15H2,1-4H3
52 atoms
O  0.466893 -2.878321 0.202807
O  -0.219073 -1.253654 1.577436
O  2.859457 2.200664 0.109488
C  -3.1074 -2.045944 0.683994
C  -2.588229 -0.989394 -0.225891
C  -1.752282 -2.244277 0.030499
C  -4.187965 -2.976564 0.186032
C  -3.223694 -1.74874 2.159161
C  -3.131918 -0.716677 -1.578158
C  -0.45984 -2.059728 0.708617
C  -2.470661 -0.058728 -2.535187
C  -3.101497 0.232433 -3.861977
C  -1.069841 0.44914 -2.368282
C  1.843923 -2.590214 0.492167
C  2.275335 -1.391719 -0.304493
C  2.428156 -0.155607 0.308405
C  2.436722 -1.500163 -1.684451
C  2.700792 0.967791 -0.461987
C  2.740265 -0.37857 -2.43887
C  2.857087 0.866549 -1.834843
C  1.928527 2.666283 0.995681
C  0.588558 2.298272 0.948278
C  2.374588 3.582375 1.940028
C  -0.297956 2.845642 1.865487
C  1.473942 4.128549 2.84208
C  0.135591 3.759936 2.815076
H  -2.195936 -0.116975 0.290467
H  -1.73622 -2.966888 -0.777147
H  -5.174117 -2.52275 0.305111
H  -4.183369 -3.905895 0.758897
H  -4.068089 -3.240861 -0.864748
H  -4.230228 -1.386163 2.37802
H  -2.523928 -0.990368 2.501614
H  -3.064269 -2.649349 2.755666
H  -4.144756 -1.050822 -1.784625
H  -3.112022 1.30707 -4.064105
H  -4.128122 -0.129471 -3.920388
H  -2.534012 -0.227219 -4.675574
H  -0.571982 0.054805 -1.483198
H  -1.057213 1.540992 -2.299816
H  -0.46024 0.189802 -3.237319
H  2.383247 -3.484909 0.184457
H  2.003876 -2.449424 1.561903
H  2.316239 -0.066847 1.38197
H  2.325077 -2.462516 -2.169378
H  2.870474 -0.465386 -3.509801
H  3.072569 1.749559 -2.423294
H  0.226566 1.597312 0.206963
H  3.419739 3.86494 1.965083
H  -1.339752 2.553507 1.828444
H  1.82665 4.841629 3.576139
H  -0.562659 4.18238 3.525672
elementType: O C H
totalener: -1117.86687440 hartree
nucrepener: 2350.88205298 hartree
electener: -3468.74892738 hartree
oneelecener: -6191.58397227 hartree
twoeener: 2722.83504490 hartree
cpcmener: -0.02400002 hartree
kineticenergy: 1112.80769275 hartree
xcener: -110.227283609270 hartree
chargesum: 0.0000000
charge: -0.287376 -0.471401 -0.332430 0.172032 -0.041378 -0.060556 -0.296144 -0.276871 -0.282856 0.358533 0.006401 -0.229830 -0.215148 0.085549 0.003325 -0.171398 -0.213410 0.269679 -0.145354 -0.230194 0.263873 -0.143354 -0.226302 -0.192758 -0.138656 -0.163901 0.097718 0.089311 0.100393 0.098163 0.090674 0.092824 0.091626 0.098078 0.123134 0.094646 0.088740 0.095722 0.017409 0.107774 0.097153 0.125227 0.112445 0.139631 0.140791 0.156822 0.145073 0.142615 0.144046 0.156948 0.155785 0.157176
qa: -0.2874 -0.4714 -0.3324 0.1720 -0.0414 -0.0606 -0.2961 -0.2769 -0.2829 0.3585 0.0064 -0.2298 -0.2151 0.0855 0.0033 -0.1714 -0.2134 0.2697 -0.1454 -0.2302 0.2639 -0.1434 -0.2263 -0.1928 -0.1387 -0.1639 0.0977 0.0893 0.1004 0.0982 0.0907 0.0928 0.0916 0.0981 0.1231 0.0946 0.0887 0.0957 0.0174 0.1078 0.0972 0.1252 0.1124 0.1396 0.1408 0.1568 0.1451 0.1426 0.1440 0.1569 0.1558 0.1572
va: 2.1108 2.0218 2.0813 3.7094 3.8341 3.7854 3.9149 3.8793 3.8742 4.1808 3.7273 3.9287 3.9362 3.8149 3.5967 3.9111 3.9262 3.7128 3.8637 3.9813 3.7269 3.8380 3.9713 3.9351 3.9090 3.8869 1.0232 1.0338 0.9987 1.0028 1.0009 1.0010 1.0204 0.9995 1.0043 0.9952 1.0071 0.9966 1.0203 0.9975 1.0036 0.9938 1.0110 1.0190 1.0054 0.9902 1.0059 0.9805 1.0089 0.9923 0.9895 0.9906
dispcorr: -0.028720493 hartree
energy: -1117.895594891641
dipole: -23.46090 22.93564 -0.52525 -5.74713 5.07020 -0.67693 -7.90940 6.98054 -0.92886
magnitude: 1.26369 au
magnitude: 3.21205 debye
