program: Orca
programVersion: 5.0.2
elementType: O O O C C C C C C C C C C C C C C C C C C C C C C C H H H H H H H H H H H H H H H H H H H H H H H H H H
charge: 0
multiplicity: 1
keywords: wb97x-d3
keywords: def2-TZVPP
keywords: def2/J RIJCOSX
keywords: DEFGRID2
keywords: scfconv7
keywords: smallprint printgap noloewdin
keywords: NOSOSCF
formula: C23H26O3
InChI: InChI=1/C23H26O3/c1-16(2)13-20-21(23(20,3)4)22(24)25-15-17-9-8-12-19(14-17)26-18-10-6-5-7-11-18/h5-14,20-21H,15H2,1-4H3
52 atoms
O  0.45709 -2.847221 0.171367
O  -0.214471 -1.286598 1.625379
O  2.794474 2.197837 0.099188
C  -3.099762 -1.999798 0.659299
C  -2.571566 -0.871006 -0.153851
C  -1.741799 -2.142657 -0.004355
C  -4.180868 -2.87662 0.073164
C  -3.218296 -1.838229 2.155001
C  -3.128485 -0.48521 -1.475359
C  -0.457398 -2.033447 0.705766
C  -2.42501 0.055392 -2.474636
C  -3.081778 0.463057 -3.758045
C  -0.948494 0.303257 -2.410782
C  1.83767 -2.604916 0.488028
C  2.308775 -1.41243 -0.294353
C  2.400867 -0.16511 0.309131
C  2.556718 -1.536164 -1.659854
C  2.696909 0.953335 -0.459802
C  2.885968 -0.418943 -2.410381
C  2.940627 0.83622 -1.819076
C  1.831941 2.62804 0.97063
C  0.495077 2.265214 0.850165
C  2.238664 3.500786 1.970997
C  -0.429728 2.775675 1.749937
C  1.3003 4.0104 2.856574
C  -0.035873 3.647932 2.755222
H  -2.181476 -0.044099 0.435964
H  -1.720352 -2.794815 -0.869857
H  -5.167173 -2.439457 0.242905
H  -4.172419 -3.860634 0.54603
H  -4.064892 -3.028255 -1.000372
H  -3.060179 -2.789085 2.668089
H  -4.22479 -1.496012 2.404817
H  -2.51875 -1.113961 2.565222
H  -4.197339 -0.624059 -1.614723
H  -2.939455 1.529997 -3.949834
H  -4.153283 0.26272 -3.755629
H  -2.641707 -0.063703 -4.609021
H  -0.491058 -0.043212 -1.485369
H  -0.729704 1.369864 -2.513256
H  -0.439791 -0.193403 -3.241542
H  2.357063 -3.511339 0.18067
H  1.983426 -2.477364 1.561212
H  2.224782 -0.064526 1.372775
H  2.492155 -2.507168 -2.135895
H  3.085399 -0.517824 -3.469555
H  3.176141 1.715287 -2.40579
H  0.167032 1.596609 0.064513
H  3.282096 3.778823 2.052714
H  -1.469529 2.489485 1.65495
H  1.621312 4.689909 3.635621
H  -0.763606 4.041402 3.452673
elementType: O C H
totalener: -1117.86660270 hartree
nucrepener: 2361.59950130 hartree
electener: -3479.46610400 hartree
oneelecener: -6212.99932138 hartree
twoeener: 2733.53321738 hartree
cpcmener: -0.02387551 hartree
kineticenergy: 1112.80768661 hartree
xcener: -110.227373744186 hartree
chargesum: -0.0000000
charge: -0.286416 -0.468925 -0.332472 0.172542 -0.032384 -0.066000 -0.292916 -0.281728 -0.288161 0.355307 0.001052 -0.230975 -0.205856 0.082642 -0.003746 -0.159475 -0.217242 0.262857 -0.134291 -0.235595 0.248606 -0.136919 -0.219270 -0.199880 -0.142596 -0.159255 0.093553 0.090583 0.098903 0.097792 0.092388 0.098707 0.092789 0.091846 0.121317 0.095614 0.089404 0.095003 0.013988 0.105683 0.103804 0.123709 0.113261 0.140632 0.140877 0.156939 0.145171 0.152671 0.144537 0.158375 0.156497 0.157047
qa: -0.2864 -0.4689 -0.3325 0.1725 -0.0324 -0.0660 -0.2929 -0.2817 -0.2882 0.3553 0.0011 -0.2310 -0.2059 0.0826 -0.0037 -0.1595 -0.2172 0.2629 -0.1343 -0.2356 0.2486 -0.1369 -0.2193 -0.1999 -0.1426 -0.1593 0.0936 0.0906 0.0989 0.0978 0.0924 0.0987 0.0928 0.0918 0.1213 0.0956 0.0894 0.0950 0.0140 0.1057 0.1038 0.1237 0.1133 0.1406 0.1409 0.1569 0.1452 0.1527 0.1445 0.1584 0.1565 0.1570
va: 2.1104 2.0222 2.0820 3.6931 3.8302 3.7870 3.9130 3.8837 3.8683 4.1770 3.7506 3.9305 3.9243 3.8184 3.6150 3.8890 3.9368 3.7213 3.8667 3.9848 3.7371 3.8306 3.9703 3.9409 3.9105 3.8844 1.0230 1.0326 0.9996 1.0029 1.0013 0.9992 1.0010 1.0200 1.0046 0.9959 1.0064 0.9967 1.0225 0.9985 1.0021 0.9943 1.0121 1.0204 1.0045 0.9896 1.0063 0.9730 1.0085 0.9918 0.9892 0.9907
dispcorr: -0.029272845 hartree
energy: -1117.895875542397
dipole: -23.11763 22.61697 -0.50066 -5.71692 5.07193 -0.64499 -8.06185 7.09838 -0.96347
magnitude: 1.26291 au
magnitude: 3.21007 debye
