program: Orca
programVersion: 5.0.2
elementType: O O O C C C C C C C C C C C C C C C C C C C C C C C H H H H H H H H H H H H H H H H H H H H H H H H H H
charge: 0
multiplicity: 1
keywords: wb97x-d3
keywords: def2-TZVPP
keywords: def2/J RIJCOSX
keywords: DEFGRID2
keywords: scfconv7
keywords: smallprint printgap noloewdin
keywords: NOSOSCF
formula: C23H26O3
InChI: InChI=1/C23H26O3/c1-16(2)13-20-21(23(20,3)4)22(24)25-15-17-9-8-12-19(14-17)26-18-10-6-5-7-11-18/h5-14,20-21H,15H2,1-4H3
52 atoms
O  0.104433 -2.13457 -0.99134
O  -0.510272 -2.871281 1.032695
O  3.563549 2.031336 -1.103639
C  -3.259797 -3.206697 -0.476992
C  -3.292277 -2.032555 0.455035
C  -2.166077 -2.153811 -0.537223
C  -4.217887 -3.224306 -1.642746
C  -2.979638 -4.578054 0.086393
C  -4.282698 -0.935943 0.316019
C  -0.7963 -2.430086 -0.050219
C  -5.448076 -0.879772 0.961719
C  -6.377061 0.284564 0.799955
C  -5.917276 -1.948758 1.901008
C  1.486612 -2.3163 -0.676802
C  2.07043 -1.092675 -0.030042
C  2.525559 -0.050475 -0.82824
C  2.144783 -0.977603 1.353679
C  3.069239 1.087925 -0.252947
C  2.683449 0.16675 1.921018
C  3.151815 1.203443 1.129404
C  3.486066 3.355499 -0.784977
C  2.322636 3.929038 -0.285679
C  4.60483 4.136783 -1.034562
C  2.291697 5.291998 -0.035206
C  4.556679 5.500278 -0.788126
C  3.404216 6.083357 -0.283722
H  -2.996287 -2.265739 1.47402
H  -2.207289 -1.505063 -1.405979
H  -4.382683 -2.233317 -2.06389
H  -5.190801 -3.608618 -1.329963
H  -3.843735 -3.870078 -2.439163
H  -2.501267 -5.21715 -0.658698
H  -3.919645 -5.055849 0.370017
H  -2.341279 -4.552966 0.966161
H  -4.022766 -0.11832 -0.35036
H  -5.997233 1.01727 0.088962
H  -6.5345 0.794943 1.753679
H  -7.361812 -0.040716 0.455409
H  -6.901963 -2.317741 1.603255
H  -6.027753 -1.556113 2.915289
H  -5.243924 -2.802767 1.943838
H  1.96849 -2.505402 -1.636012
H  1.625645 -3.195511 -0.046533
H  2.473559 -0.121149 -1.908267
H  1.778631 -1.777975 1.981825
H  2.749275 0.252899 2.997588
H  3.584594 2.084661 1.584917
H  1.447668 3.3195 -0.099192
H  5.501546 3.673372 -1.424395
H  1.384901 5.738476 0.3511
H  5.430387 6.10716 -0.985792
H  3.371166 7.14667 -0.08891
totalener: -1117.84769987 hartree
nucrepener: 2153.31438227 hartree
electener: -3271.16208214 hartree
oneelecener: -5795.41049264 hartree
twoeener: 2524.24841050 hartree
kineticenergy: 1112.85789340 hartree
xcener: -110.230637653534 hartree
chargesum: 0.0000000
charge: -0.261817 -0.404276 -0.299367 0.108245 -0.026641 -0.114963 -0.239441 -0.277195 -0.187175 0.370494 -0.029335 -0.212451 -0.234654 0.047853 -0.002336 -0.224730 -0.125176 0.219469 -0.124419 -0.155314 0.239339 -0.162914 -0.206296 -0.115280 -0.093588 -0.143330 0.103327 0.076055 0.079555 0.086340 0.092861 0.088988 0.083299 0.103487 0.088853 0.078415 0.086571 0.082766 0.083544 0.093726 0.080937 0.104397 0.109143 0.109663 0.129202 0.127119 0.132149 0.134131 0.124352 0.126307 0.124847 0.125266
qa: -0.2618 -0.4043 -0.2994 0.1082 -0.0266 -0.1150 -0.2394 -0.2772 -0.1872 0.3705 -0.0293 -0.2125 -0.2347 0.0479 -0.0023 -0.2247 -0.1252 0.2195 -0.1244 -0.1553 0.2393 -0.1629 -0.2063 -0.1153 -0.0936 -0.1433 0.1033 0.0761 0.0796 0.0863 0.0929 0.0890 0.0833 0.1035 0.0889 0.0784 0.0866 0.0828 0.0835 0.0937 0.0809 0.1044 0.1091 0.1097 0.1292 0.1271 0.1321 0.1341 0.1244 0.1263 0.1248 0.1253
va: 2.1362 2.0959 2.1031 3.7065 3.8031 3.8996 3.9065 3.9050 3.8618 4.2270 3.7387 3.9417 3.9427 3.8484 3.7038 4.0893 3.9480 3.8687 3.9740 3.9381 3.8134 3.9465 4.0372 3.9461 3.9341 3.9581 1.0271 1.0369 1.0079 1.0048 1.0051 1.0028 1.0022 1.0204 1.0142 1.0108 0.9973 0.9993 1.0005 1.0007 1.0113 0.9975 1.0131 1.0242 1.0225 1.0012 1.0037 1.0034 1.0141 1.0000 0.9990 1.0003
dispcorr: -0.023089913 hartree
energy: -1117.870789778184
dipole: -35.80566 35.34005 -0.46561 -12.03494 12.36571 0.33077 3.66433 -3.77876 -0.11444
magnitude: 0.58249 au
magnitude: 1.48058 debye
