program: Orca
programVersion: 5.0.2
elementType: O O O C C C C C C C C C C C C C C C C C C C C C C C H H H H H H H H H H H H H H H H H H H H H H H H H H
charge: 0
multiplicity: 1
keywords: wb97x-d3
keywords: def2-TZVPP
keywords: def2/J RIJCOSX
keywords: DEFGRID2
keywords: scfconv7
keywords: smallprint printgap noloewdin
keywords: NOSOSCF
formula: C23H26O3
InChI: InChI=1/C23H26O3/c1-16(2)13-20-21(23(20,3)4)22(24)25-15-17-9-8-12-19(14-17)26-18-10-6-5-7-11-18/h5-14,20-21H,15H2,1-4H3
52 atoms
O  0.116753 -1.804975 1.007494
O  -0.511694 -2.261217 -1.09705
O  3.419022 1.645291 -0.731138
C  -2.211582 0.365857 -0.546523
C  -3.071629 -0.848947 -0.634808
C  -1.872023 -0.862877 0.286265
C  -2.705048 1.559273 0.234975
C  -1.353548 0.747332 -1.727713
C  -4.44669 -0.89103 -0.073167
C  -0.713396 -1.716587 -0.044597
C  -5.023816 -1.971591 0.45417
C  -6.42616 -1.933232 0.980952
C  -4.33635 -3.298408 0.56316
C  1.320597 -2.536781 0.859825
C  2.507734 -1.645617 0.604183
C  2.367264 -0.374652 0.065962
C  3.778866 -2.132315 0.89017
C  3.493299 0.404014 -0.172281
C  4.895607 -1.355573 0.631086
C  4.762465 -0.080317 0.106749
C  2.346856 2.453776 -0.495148
C  1.844346 3.172967 -1.570538
C  1.801172 2.613543 0.773692
C  0.794655 4.057391 -1.373903
C  0.745616 3.493306 0.953558
C  0.236306 4.218068 -0.114914
H  -2.922906 -1.435791 -1.538108
H  -2.068669 -0.761615 1.347518
H  -1.861823 2.165279 0.569102
H  -3.284937 1.27496 1.113061
H  -3.337675 2.192618 -0.39101
H  -1.013083 -0.112864 -2.299823
H  -0.477715 1.315349 -1.406454
H  -1.923352 1.388399 -2.403103
H  -5.02486 0.02714 -0.126335
H  -6.456659 -2.216872 2.035997
H  -7.065073 -2.643469 0.450312
H  -6.873774 -0.944564 0.8866
H  -3.33988 -3.300019 0.127188
H  -4.919214 -4.075085 0.061982
H  -4.248686 -3.604898 1.608793
H  1.229598 -3.273855 0.058712
H  1.46367 -3.077587 1.797015
H  1.388232 0.021156 -0.167461
H  3.89692 -3.120834 1.317694
H  5.882262 -1.739341 0.854163
H  5.628325 0.53833 -0.087494
H  2.281157 3.038532 -2.551241
H  2.196941 2.059683 1.615042
H  0.407639 4.617675 -2.21465
H  0.323911 3.616691 1.942551
H  -0.586405 4.904047 0.034684
totalener: -1117.84671873 hartree
nucrepener: 2310.20491001 hartree
electener: -3428.05162874 hartree
oneelecener: -6108.98972265 hartree
twoeener: 2680.93809391 hartree
kineticenergy: 1112.84681666 hartree
xcener: -110.235516917651 hartree
chargesum: 0.0000000
charge: -0.267610 -0.371587 -0.296494 0.162402 -0.022786 -0.105885 -0.285368 -0.228068 -0.245780 0.296377 -0.001093 -0.211905 -0.228004 0.053952 0.037586 -0.160060 -0.203030 0.272553 -0.079275 -0.224635 0.241306 -0.179039 -0.158497 -0.095805 -0.126347 -0.160878 0.106914 0.081487 0.083902 0.088526 0.090271 0.110728 0.028479 0.089299 0.092946 0.083966 0.087163 0.078186 0.082322 0.089662 0.085786 0.113285 0.103567 0.095929 0.106068 0.123463 0.124052 0.123294 0.132233 0.124465 0.133347 0.128627
qa: -0.2676 -0.3716 -0.2965 0.1624 -0.0228 -0.1059 -0.2854 -0.2281 -0.2458 0.2964 -0.0011 -0.2119 -0.2280 0.0540 0.0376 -0.1601 -0.2030 0.2726 -0.0793 -0.2246 0.2413 -0.1790 -0.1585 -0.0958 -0.1263 -0.1609 0.1069 0.0815 0.0839 0.0885 0.0903 0.1107 0.0285 0.0893 0.0929 0.0840 0.0872 0.0782 0.0823 0.0897 0.0858 0.1133 0.1036 0.0959 0.1061 0.1235 0.1241 0.1233 0.1322 0.1245 0.1333 0.1286
va: 2.1226 2.1221 2.1203 3.6888 3.8336 3.8236 3.9053 3.8807 3.9097 4.2519 3.7296 3.9420 3.9427 3.8797 3.7375 3.9550 4.0095 3.7841 3.9510 4.0372 3.8121 3.9754 3.9183 3.8935 3.8821 3.8999 1.0280 1.0346 1.0236 1.0076 1.0016 1.0214 1.0229 1.0064 1.0104 0.9988 0.9986 1.0098 1.0187 1.0019 1.0006 1.0123 0.9913 1.0032 1.0110 0.9996 1.0147 1.0150 1.0030 0.9997 0.9984 1.0001
dispcorr: -0.027843784 hartree
energy: -1117.874562518844
dipole: -28.91855 28.52861 -0.38994 -2.94530 3.14915 0.20385 2.64473 -1.90099 0.74374
magnitude: 0.86416 au
magnitude: 2.19651 debye
