program: Orca
programVersion: 5.0.2
elementType: O O O C C C C C C C C C C C C C C C C C C C C C C C H H H H H H H H H H H H H H H H H H H H H H H H H H
charge: 0
multiplicity: 1
keywords: wb97x-d3
keywords: def2-TZVPP
keywords: def2/J RIJCOSX
keywords: DEFGRID2
keywords: scfconv7
keywords: smallprint printgap noloewdin
keywords: NOSOSCF
formula: C23H26O3
InChI: InChI=1/C23H26O3/c1-16(2)13-20-21(23(20,3)4)22(24)25-15-17-9-8-12-19(14-17)26-18-10-6-5-7-11-18/h5-14,20-21H,15H2,1-4H3
52 atoms
O  -0.039839 -2.414471 -1.109358
O  -1.247896 -0.559913 -1.427303
O  2.518824 2.740521 -0.35968
C  -2.996263 -1.987547 0.797733
C  -3.67907 -2.001489 -0.536735
C  -2.260106 -2.488677 -0.435727
C  -3.360246 -3.044159 1.811785
C  -2.629601 -0.661954 1.418697
C  -4.76423 -2.959014 -0.873083
C  -1.168347 -1.695065 -1.041309
C  -6.030746 -2.845428 -0.471218
C  -7.073986 -3.839375 -0.882889
C  -6.515608 -1.727314 0.400251
C  1.118468 -1.736966 -1.587581
C  1.668458 -0.773905 -0.572369
C  1.868253 0.556592 -0.905562
C  1.998632 -1.218328 0.704365
C  2.398101 1.4390 0.025855
C  2.513774 -0.328754 1.632048
C  2.716687 1.003713 1.304948
C  3.566357 3.497422 0.073818
C  4.863256 3.002758 0.149346
C  3.301136 4.823118 0.386757
C  5.888681 3.845183 0.550127
C  4.338274 5.656692 0.775211
C  5.634691 5.172096 0.865028
H  -3.765502 -1.022282 -1.001685
H  -2.104236 -3.562239 -0.464117
H  -3.603757 -3.999867 1.349793
H  -4.230733 -2.734671 2.393761
H  -2.536057 -3.20501 2.509118
H  -1.741498 -0.755938 2.046827
H  -3.446563 -0.316797 2.055972
H  -2.433977 0.112547 0.680904
H  -4.498536 -3.795609 -1.513287
H  -7.875379 -3.357372 -1.448447
H  -7.543536 -4.301217 -0.010638
H  -6.659974 -4.634298 -1.502207
H  -6.984913 -2.116112 1.307388
H  -7.279567 -1.139054 -0.114588
H  -5.718506 -1.049169 0.69867
H  0.909972 -1.227663 -2.53082
H  1.837625 -2.532295 -1.78703
H  1.594343 0.924188 -1.886523
H  1.847232 -2.25548 0.975574
H  2.762136 -0.671592 2.627871
H  3.112113 1.692115 2.040322
H  5.073889 1.972046 -0.105059
H  2.286389 5.192346 0.318088
H  6.897667 3.458498 0.608173
H  4.127157 6.690313 1.015644
H  6.4412 5.823099 1.17369
totalener: -1117.84660919 hartree
nucrepener: 2169.24887761 hartree
electener: -3287.09548680 hartree
oneelecener: -5827.40736787 hartree
twoeener: 2540.31188107 hartree
kineticenergy: 1112.85801511 hartree
xcener: -110.231414394138 hartree
chargesum: -0.0000000
charge: -0.270688 -0.378534 -0.296465 0.064889 -0.024940 -0.089511 -0.248697 -0.258171 -0.193568 0.339868 -0.021432 -0.211081 -0.243412 0.060614 0.037993 -0.170586 -0.225478 0.219299 -0.090638 -0.174558 0.249297 -0.167967 -0.211113 -0.116284 -0.091324 -0.145957 0.108762 0.079941 0.083324 0.084437 0.095692 0.088795 0.080388 0.104005 0.088152 0.086656 0.083012 0.079424 0.086373 0.098400 0.083946 0.101050 0.110603 0.108576 0.115847 0.125845 0.132635 0.131711 0.126041 0.125781 0.124388 0.124662
qa: -0.2707 -0.3785 -0.2965 0.0649 -0.0249 -0.0895 -0.2487 -0.2582 -0.1936 0.3399 -0.0214 -0.2111 -0.2434 0.0606 0.0380 -0.1706 -0.2255 0.2193 -0.0906 -0.1746 0.2493 -0.1680 -0.2111 -0.1163 -0.0913 -0.1460 0.1088 0.0799 0.0833 0.0844 0.0957 0.0888 0.0804 0.1040 0.0882 0.0867 0.0830 0.0794 0.0864 0.0984 0.0839 0.1011 0.1106 0.1086 0.1158 0.1258 0.1326 0.1317 0.1260 0.1258 0.1244 0.1247
va: 2.1209 2.1296 2.1098 3.7492 3.8150 3.8223 3.9040 3.9051 3.8589 4.2697 3.7384 3.9387 3.9356 3.8603 3.6765 4.0496 4.0039 3.8671 3.9241 3.9584 3.8102 3.9397 4.0350 3.9453 3.9335 3.9610 1.0274 1.0341 1.0070 1.0023 1.0058 1.0043 1.0029 1.0204 1.0132 0.9980 0.9991 1.0105 0.9993 1.0033 1.0108 1.0107 0.9889 1.0288 1.0184 1.0001 1.0035 1.0046 1.0141 1.0001 0.9991 1.0005
dispcorr: -0.024244710 hartree
energy: -1117.870853899950
dipole: -31.62778 31.72672 0.09894 -15.74733 15.18920 -0.55813 8.37267 -7.76141 0.61126
magnitude: 0.83362 au
magnitude: 2.11891 debye
