program: Orca
programVersion: 5.0.2
elementType: O O O C C C C C C C C C C C C C C C C C C C C C C C H H H H H H H H H H H H H H H H H H H H H H H H H H
charge: 0
multiplicity: 1
keywords: wb97x-d3
keywords: def2-TZVPP
keywords: def2/J RIJCOSX
keywords: DEFGRID2
keywords: scfconv7
keywords: smallprint printgap noloewdin
keywords: NOSOSCF
formula: C23H26O3
InChI: InChI=1/C23H26O3/c1-16(2)13-20-21(23(20,3)4)22(24)25-15-17-9-8-12-19(14-17)26-18-10-6-5-7-11-18/h5-14,20-21H,15H2,1-4H3
52 atoms
O  -0.581154 -1.029778 1.52982
O  -0.742692 -2.8625 0.251317
O  3.723198 2.416505 0.750441
C  -3.29061 -1.402169 -0.815413
C  -3.686505 -2.467625 0.162267
C  -2.641542 -1.445409 0.556105
C  -4.226336 -0.244365 -1.068238
C  -2.519318 -1.806816 -2.048409
C  -4.994324 -2.474434 0.847111
C  -1.239974 -1.879122 0.737746
C  -5.87354 -3.478607 0.876538
C  -7.168206 -3.34604 1.62232
C  -5.681868 -4.798782 0.193023
C  0.797287 -1.291326 1.807383
C  1.702107 -0.592611 0.831304
C  2.285685 0.617057 1.18384
C  1.956562 -1.132405 -0.426695
C  3.126946 1.277261 0.299267
C  2.785877 -0.459065 -1.308739
C  3.379544 0.743781 -0.95732
C  3.945326 3.462533 -0.096255
C  5.15966 4.124089 0.015366
C  2.984382 3.902264 -0.9987
C  5.411008 5.233617 -0.777067
C  3.253358 5.006751 -1.792073
C  4.463616 5.67721 -1.687309
H  -3.266346 -3.442298 -0.060697
H  -2.959523 -0.66399 1.237865
H  -4.729595 0.103755 -0.167313
H  -4.998477 -0.529373 -1.784936
H  -3.679205 0.60223 -1.486455
H  -3.218547 -2.023467 -2.858295
H  -1.905053 -2.690019 -1.894532
H  -1.866859 -0.998303 -2.383995
H  -5.258513 -1.56525 1.379764
H  -7.276639 -2.367132 2.087916
H  -7.24815 -4.10078 2.408915
H  -8.022842 -3.498097 0.958247
H  -6.473594 -4.966905 -0.542041
H  -5.747672 -5.61991 0.911384
H  -4.730806 -4.889226 -0.327058
H  0.988016 -2.365177 1.816261
H  0.961077 -0.908213 2.814449
H  2.101346 1.053845 2.158009
H  1.510997 -2.07566 -0.709963
H  2.98743 -0.881706 -2.284125
H  4.040087 1.24967 -1.649532
H  5.895207 3.770283 0.725809
H  2.033147 3.391591 -1.077633
H  6.357982 5.749067 -0.685085
H  2.503656 5.348838 -2.493309
H  4.664423 6.540072 -2.307662
totalener: -1117.84829965 hartree
nucrepener: 2140.72503482 hartree
electener: -3258.57333447 hartree
oneelecener: -5770.11160720 hartree
twoeener: 2511.53827273 hartree
kineticenergy: 1112.84744282 hartree
xcener: -110.230399420224 hartree
chargesum: -0.0000000
charge: -0.262045 -0.407796 -0.299775 0.098830 0.038654 -0.110510 -0.239219 -0.265826 -0.189143 0.368251 -0.047652 -0.204469 -0.236590 0.051727 0.009618 -0.226854 -0.156699 0.217339 -0.116481 -0.156313 0.239309 -0.207052 -0.161263 -0.093283 -0.116100 -0.143913 0.090659 0.070879 0.070327 0.090576 0.091366 0.085128 0.099831 0.085898 0.073301 0.076392 0.085287 0.083081 0.085108 0.086314 0.082885 0.115561 0.095653 0.109492 0.143852 0.127891 0.132893 0.124964 0.133546 0.124854 0.126316 0.125201
qa: -0.2620 -0.4078 -0.2998 0.0988 0.0387 -0.1105 -0.2392 -0.2658 -0.1891 0.3683 -0.0477 -0.2045 -0.2366 0.0517 0.0096 -0.2269 -0.1567 0.2173 -0.1165 -0.1563 0.2393 -0.2071 -0.1613 -0.0933 -0.1161 -0.1439 0.0907 0.0709 0.0703 0.0906 0.0914 0.0851 0.0998 0.0859 0.0733 0.0764 0.0853 0.0831 0.0851 0.0863 0.0829 0.1156 0.0957 0.1095 0.1439 0.1279 0.1329 0.1250 0.1335 0.1249 0.1263 0.1252
va: 2.1402 2.0901 2.1033 3.7289 3.7751 3.9168 3.9122 3.9128 3.8950 4.2051 3.8165 3.9356 3.9465 3.8482 3.7248 4.1054 3.9457 3.8794 3.9610 3.9471 3.8143 4.0357 3.9443 3.9352 3.9466 3.9589 1.0350 1.0394 1.0111 1.0047 1.0041 1.0016 1.0217 1.0030 1.0205 1.0121 0.9981 0.9985 0.9993 0.9991 1.0151 1.0109 1.0002 1.0238 1.0205 1.0013 1.0037 1.0140 1.0035 0.9989 1.0000 1.0004
dispcorr: -0.022600554 hartree
energy: -1117.870900198644
dipole: -34.98753 34.58595 -0.40158 -14.76907 15.19096 0.42189 -5.79800 5.53305 -0.26495
magnitude: 0.63988 au
magnitude: 1.62646 debye
