program: Orca
programVersion: 5.0.2
elementType: O O O C C C C C C C C C C C C C C C C C C C C C C C H H H H H H H H H H H H H H H H H H H H H H H H H H
charge: 0
multiplicity: 1
keywords: wb97x-d3
keywords: def2-TZVPP
keywords: def2/J RIJCOSX
keywords: DEFGRID2
keywords: scfconv7
keywords: smallprint printgap noloewdin
keywords: NOSOSCF
formula: C23H26O3
InChI: InChI=1/C23H26O3/c1-16(2)13-20-21(23(20,3)4)22(24)25-15-17-9-8-12-19(14-17)26-18-10-6-5-7-11-18/h5-14,20-21H,15H2,1-4H3
52 atoms
O  -0.28169 -1.470373 -1.824459
O  -1.218333 0.178324 -0.639111
O  3.13643 1.880772 1.401431
C  -2.656499 -2.244409 0.744646
C  -3.595563 -1.552712 -0.195628
C  -2.241778 -1.982858 -0.695448
C  -2.915743 -3.690039 1.091415
C  -2.042678 -1.460658 1.879112
C  -4.818957 -2.208192 -0.727543
C  -1.22553 -0.961237 -1.022641
C  -5.963184 -2.335268 -0.054868
C  -7.165088 -2.987878 -0.666604
C  -6.149648 -1.835575 1.345018
C  0.820204 -0.621208 -2.136488
C  1.793627 -0.538484 -0.994451
C  2.0087 0.661529 -0.334933
C  2.474634 -1.681475 -0.583274
C  2.923261 0.723375 0.709787
C  3.366806 -1.615269 0.472141
C  3.604326 -0.410899 1.119117
C  3.406759 3.031366 0.721978
C  4.097103 3.047204 -0.484539
C  3.002674 4.220788 1.313715
C  4.370773 4.26125 -1.095627
C  3.292082 5.426343 0.695466
C  3.970951 5.4548 -0.514169
H  -3.675579 -0.479932 -0.037027
H  -2.210361 -2.865253 -1.325867
H  -3.630511 -3.763296 1.91374
H  -1.992997 -4.17873 1.408414
H  -3.32611 -4.2538 0.254992
H  -2.684143 -1.532378 2.76008
H  -1.912117 -0.406908 1.647268
H  -1.066494 -1.865634 2.151589
H  -4.770739 -2.590688 -1.743073
H  -8.012634 -2.299018 -0.698174
H  -7.48738 -3.848983 -0.076221
H  -6.974401 -3.329798 -1.682894
H  -6.935658 -1.077016 1.381898
H  -5.245127 -1.398111 1.76294
H  -6.470205 -2.643767 2.00691
H  0.476862 0.372148 -2.4309
H  1.289118 -1.086531 -3.003823
H  1.454357 1.545237 -0.625803
H  2.303334 -2.623454 -1.089135
H  3.894975 -2.504251 0.790133
H  4.307909 -0.346799 1.938509
H  4.424403 2.123904 -0.944324
H  2.466951 4.192548 2.253422
H  4.908598 4.269135 -2.034614
H  2.975388 6.350316 1.161033
H  4.189396 6.397649 -0.99661
totalener: -1117.84690017 hartree
nucrepener: 2192.84517516 hartree
electener: -3310.69207533 hartree
oneelecener: -5874.61460005 hartree
twoeener: 2563.92252472 hartree
kineticenergy: 1112.87029824 hartree
xcener: -110.233262787220 hartree
chargesum: -0.0000000
charge: -0.269185 -0.391027 -0.300476 0.069425 -0.028986 -0.094207 -0.248398 -0.262510 -0.189454 0.359042 -0.023648 -0.211133 -0.241564 0.054636 -0.009682 -0.100419 -0.195679 0.192818 -0.092142 -0.195411 0.243705 -0.152633 -0.209592 -0.124185 -0.089551 -0.149167 0.109061 0.078673 0.084701 0.096285 0.082567 0.079999 0.105085 0.090951 0.088868 0.086140 0.083999 0.079176 0.097915 0.083058 0.086138 0.102425 0.111880 0.122534 0.114436 0.125191 0.126384 0.127333 0.124122 0.124789 0.123841 0.123872
qa: -0.2692 -0.3910 -0.3005 0.0694 -0.0290 -0.0942 -0.2484 -0.2625 -0.1895 0.3590 -0.0236 -0.2111 -0.2416 0.0546 -0.0097 -0.1004 -0.1957 0.1928 -0.0921 -0.1954 0.2437 -0.1526 -0.2096 -0.1242 -0.0896 -0.1492 0.1091 0.0787 0.0847 0.0963 0.0826 0.0800 0.1051 0.0910 0.0889 0.0861 0.0840 0.0792 0.0979 0.0831 0.0861 0.1024 0.1119 0.1225 0.1144 0.1252 0.1264 0.1273 0.1241 0.1248 0.1238 0.1239
va: 2.1281 2.1141 2.1047 3.7364 3.8186 3.8509 3.9061 3.9051 3.8549 4.2366 3.7390 3.9390 3.9358 3.8699 3.6742 3.8997 4.0057 3.8621 3.9263 4.0434 3.8208 3.9171 4.0317 3.9599 3.9387 3.9627 1.0261 1.0347 1.0023 1.0059 1.0070 1.0019 1.0215 1.0032 1.0131 0.9981 0.9989 1.0105 1.0031 1.0111 0.9992 1.0115 0.9910 1.0227 1.0143 0.9992 1.0113 1.0073 1.0145 1.0003 0.9988 1.0007
dispcorr: -0.024245405 hartree
energy: -1117.871145577799
dipole: -31.35118 31.19888 -0.15230 -16.72085 16.06550 -0.65535 4.79420 -5.05876 -0.26455
magnitude: 0.72296 au
magnitude: 1.83762 debye
