program: Orca
programVersion: 5.0.2
elementType: O O O C C C C C C C C C C C C C C C C C C C C C C C H H H H H H H H H H H H H H H H H H H H H H H H H H
charge: 0
multiplicity: 1
keywords: wb97x-d3
keywords: def2-TZVPP
keywords: def2/J RIJCOSX
keywords: DEFGRID2
keywords: scfconv7
keywords: smallprint printgap noloewdin
keywords: NOSOSCF
formula: C23H26O3
InChI: InChI=1/C23H26O3/c1-16(2)13-20-21(23(20,3)4)22(24)25-15-17-9-8-12-19(14-17)26-18-10-6-5-7-11-18/h5-14,20-21H,15H2,1-4H3
52 atoms
O  0.035578 -2.301626 -1.049904
O  -0.368074 -3.200778 0.960918
O  1.81114 2.709817 -0.764533
C  -3.105364 -3.982033 -0.387162
C  -3.268634 -2.792782 0.494551
C  -2.172325 -2.793492 -0.553207
C  -4.083429 -4.191767 -1.518993
C  -2.60596 -5.273498 0.212551
C  -4.411342 -1.852255 0.375473
C  -0.765531 -2.808397 -0.106429
C  -4.345069 -0.542874 0.621699
C  -5.552742 0.336177 0.501445
C  -3.083419 0.154373 1.031719
C  1.413777 -2.120754 -0.719909
C  1.624895 -0.830738 0.021041
C  1.674061 0.36511 -0.68788
C  1.745489 -0.809687 1.405363
C  1.830048 1.567697 -0.018402
C  1.904603 0.39877 2.067632
C  1.942468 1.592801 1.367015
C  2.710023 3.704303 -0.516421
C  4.025648 3.45041 -0.145126
C  2.27268 5.00864 -0.704295
C  4.895275 4.513971 0.042258
C  3.155719 6.060764 -0.521294
C  4.468886 5.821052 -0.142579
H  -2.890023 -2.934606 1.504148
H  -2.354034 -2.18899 -1.43427
H  -4.970055 -4.72364 -1.167378
H  -3.631444 -4.792645 -2.309787
H  -4.414626 -3.253787 -1.96467
H  -2.091154 -5.87839 -0.536425
H  -3.451706 -5.857288 0.580939
H  -1.923452 -5.116244 1.043861
H  -5.370505 -2.277119 0.093147
H  -5.379591 1.144751 -0.213234
H  -5.788962 0.811838 1.456587
H  -6.43293 -0.217186 0.176075
H  -2.778592 0.881651 0.274784
H  -2.248212 -0.523036 1.194053
H  -3.23755 0.717274 1.955361
H  1.929369 -2.101337 -1.680029
H  1.791293 -2.969316 -0.147809
H  1.586808 0.36975 -1.768142
H  1.699115 -1.734326 1.963882
H  1.989951 0.413833 3.146275
H  2.055671 2.533002 1.891458
H  4.373026 2.434497 -0.006985
H  1.246228 5.188963 -0.996743
H  5.919399 4.313462 0.329601
H  2.810181 7.075504 -0.669934
H  5.154392 6.644422 0.00472
totalener: -1117.84731368 hartree
nucrepener: 2199.43156806 hartree
electener: -3317.27888175 hartree
oneelecener: -5887.68372025 hartree
twoeener: 2570.40483850 hartree
kineticenergy: 1112.84979154 hartree
xcener: -110.229698236638 hartree
chargesum: -0.0000000
charge: -0.260821 -0.403085 -0.300052 0.133233 -0.027319 -0.095071 -0.275682 -0.258895 -0.241459 0.340496 -0.000779 -0.212913 -0.218000 0.052812 0.002626 -0.225512 -0.124005 0.210683 -0.117783 -0.156030 0.242814 -0.157669 -0.211326 -0.120452 -0.092107 -0.146079 0.103875 0.083220 0.091158 0.091000 0.083929 0.084223 0.083337 0.101459 0.093095 0.084415 0.086877 0.078225 0.089400 0.079166 0.086527 0.105841 0.107621 0.111067 0.124608 0.128022 0.133874 0.131602 0.124170 0.125949 0.124897 0.124819
qa: -0.2608 -0.4031 -0.3001 0.1332 -0.0273 -0.0951 -0.2757 -0.2589 -0.2415 0.3405 -0.0008 -0.2129 -0.2180 0.0528 0.0026 -0.2255 -0.1240 0.2107 -0.1178 -0.1560 0.2428 -0.1577 -0.2113 -0.1205 -0.0921 -0.1461 0.1039 0.0832 0.0912 0.0910 0.0839 0.0842 0.0833 0.1015 0.0931 0.0844 0.0869 0.0782 0.0894 0.0792 0.0865 0.1058 0.1076 0.1111 0.1246 0.1280 0.1339 0.1316 0.1242 0.1259 0.1249 0.1248
va: 2.1247 2.0907 2.1006 3.7317 3.8348 3.8082 3.9119 3.8969 3.8973 4.2035 3.7345 3.9423 3.9500 3.8524 3.6722 4.0877 3.9427 3.8663 3.9570 3.9519 3.8125 3.9258 4.0319 3.9536 3.9380 3.9609 1.0276 1.0332 1.0007 1.0065 1.0048 1.0022 1.0022 1.0212 1.0098 0.9988 0.9988 1.0095 1.0013 1.0168 1.0025 0.9951 1.0124 1.0246 1.0234 1.0006 1.0022 1.0049 1.0144 1.0001 0.9988 1.0005
dispcorr: -0.024071405 hartree
energy: -1117.871385087674
dipole: -24.77233 24.79592 0.02359 -11.54170 11.90771 0.36602 1.52504 -1.68444 -0.15941
magnitude: 0.39992 au
magnitude: 1.01651 debye
