program: Orca
programVersion: 5.0.2
elementType: O O O C C C C C C C C C C C C C C C C C C C C C C C H H H H H H H H H H H H H H H H H H H H H H H H H H
charge: 0
multiplicity: 1
keywords: wb97x-d3
keywords: def2-TZVPP
keywords: def2/J RIJCOSX
keywords: DEFGRID2
keywords: scfconv7
keywords: smallprint printgap noloewdin
keywords: NOSOSCF
formula: C23H26O3
InChI: InChI=1/C23H26O3/c1-16(2)13-20-21(23(20,3)4)22(24)25-15-17-9-8-12-19(14-17)26-18-10-6-5-7-11-18/h5-14,20-21H,15H2,1-4H3
52 atoms
O  -0.275827 -0.509983 1.402971
O  -0.540293 -2.71636 1.11354
O  4.286353 1.844796 -0.676899
C  -2.789295 -1.805826 -0.858677
C  -3.403788 -2.186544 0.451748
C  -2.260692 -1.20172 0.433194
C  -3.529762 -0.849503 -1.761678
C  -1.987948 -2.836713 -1.615681
C  -4.750668 -1.727372 0.881991
C  -0.952868 -1.590436 1.002781
C  -5.907174 -2.19343 0.409244
C  -7.222306 -1.692703 0.924558
C  -5.99689 -3.246956 -0.651961
C  1.022757 -0.698346 1.97141
C  2.093183 -0.630635 0.919731
C  2.66996 0.596574 0.613744
C  2.503723 -1.774223 0.243171
C  3.648204 0.681118 -0.368502
C  3.484487 -1.67993 -0.732071
C  4.056601 -0.458567 -1.047497
C  3.634102 3.037556 -0.552213
C  2.375164 3.24412 -1.103542
C  4.29534 4.067912 0.098687
C  1.782354 4.491578 -0.992822
C  3.694866 5.314577 0.193493
C  2.436202 5.53096 -0.345968
H  -3.116664 -3.173313 0.808044
H  -2.52197 -0.159677 0.583428
H  -2.831808 -0.328439 -2.41916
H  -4.093587 -0.101812 -1.205864
H  -4.238874 -1.389555 -2.392302
H  -1.503066 -3.559204 -0.964849
H  -1.216053 -2.362939 -2.225017
H  -2.647624 -3.38475 -2.291975
H  -4.779849 -0.970186 1.660499
H  -7.82687 -1.273353 0.116455
H  -7.098833 -0.923758 1.686091
H  -7.808156 -2.505752 1.360486
H  -6.560005 -2.881742 -1.514572
H  -6.534518 -4.12326 -0.280819
H  -5.021412 -3.578456 -1.002376
H  1.070127 -1.640764 2.518092
H  1.138674 0.116703 2.685933
H  2.357222 1.484526 1.150258
H  2.05549 -2.729857 0.477859
H  3.806931 -2.568531 -1.258409
H  4.822601 -0.381366 -1.807863
H  1.86423 2.439057 -1.616048
H  5.276012 3.889641 0.519858
H  0.802774 4.6522 -1.4233
H  4.214471 6.117988 0.698657
H  1.968859 6.503067 -0.267387
totalener: -1117.84738706 hartree
nucrepener: 2184.72479278 hartree
electener: -3302.57217984 hartree
oneelecener: -5858.15455066 hartree
twoeener: 2555.58237082 hartree
kineticenergy: 1112.85388448 hartree
xcener: -110.230642098641 hartree
chargesum: 0.0000000
charge: -0.262560 -0.404778 -0.299159 0.065190 -0.031569 -0.089485 -0.247489 -0.263833 -0.190336 0.367131 -0.018561 -0.211326 -0.248099 0.045306 -0.006634 -0.177761 -0.154130 0.220248 -0.095588 -0.203336 0.236390 -0.160325 -0.203365 -0.112782 -0.095175 -0.141914 0.108254 0.081136 0.096995 0.083214 0.083213 0.103823 0.090024 0.079099 0.089015 0.084044 0.079474 0.086760 0.088734 0.098458 0.084460 0.112413 0.097901 0.116570 0.134609 0.125707 0.124959 0.132521 0.125652 0.126753 0.124898 0.125253
qa: -0.2626 -0.4048 -0.2992 0.0652 -0.0316 -0.0895 -0.2475 -0.2638 -0.1903 0.3671 -0.0186 -0.2113 -0.2481 0.0453 -0.0066 -0.1778 -0.1541 0.2202 -0.0956 -0.2033 0.2364 -0.1603 -0.2034 -0.1128 -0.0952 -0.1419 0.1083 0.0811 0.0970 0.0832 0.0832 0.1038 0.0900 0.0791 0.0890 0.0840 0.0795 0.0868 0.0887 0.0985 0.0845 0.1124 0.0979 0.1166 0.1346 0.1257 0.1250 0.1325 0.1257 0.1268 0.1249 0.1253
va: 2.1384 2.0955 2.1062 3.7361 3.8204 3.8488 3.9052 3.9052 3.8617 4.2147 3.7337 3.9371 3.9345 3.8622 3.7181 3.9635 3.9523 3.8594 3.9534 4.0303 3.8230 3.9549 4.0372 3.9418 3.9322 3.9585 1.0253 1.0345 1.0063 1.0073 1.0022 1.0227 1.0030 1.0030 1.0129 0.9990 1.0107 0.9982 0.9982 1.0042 1.0102 1.0119 1.0000 1.0139 1.0215 0.9995 1.0128 1.0038 1.0133 0.9998 0.9992 1.0004
dispcorr: -0.023918747 hartree
energy: -1117.871305803470
dipole: -36.24102 35.55262 -0.68840 -11.62019 12.17463 0.55444 -6.00299 5.85311 -0.14987
magnitude: 0.89652 au
magnitude: 2.27879 debye
