program: Gaussian 09
title: 000074908
version: EM64L-G09RevD.01
frameworkgroup: C1[X(C10H6Cl2)]
method: RPBEPBE
basis: SDD
operation: Freq
keyword: #pfreq=noraman
keyword: PBEPBE/SDD
title: #p freq=noraman PBEPBE/SDD
converged: NO NO NO YES
title: Mulliken charges:
elementType: Cl Cl C C C C C C C C C C H H H H H H
charge: -0.052733 -0.051572 0.443866 0.411690 -0.357941 -0.386289 -0.289876 -0.434722 -0.221506 -0.115143 -0.250380 -0.227196 0.263738 0.265271 0.246687 0.259738 0.258999 0.237369
chargesum: 0.00000
title: Mulliken charges with hydrogens summed into heavy atoms:
elementType: Cl Cl C C C C C C C C C C
charge: -0.052733 -0.051572 0.443866 0.411690 -0.094203 -0.121018 -0.289876 -0.188034 0.038232 -0.115143 0.008619 0.010173
polarizability: 1.95454135e+02 1.11513748e+01 1.41531934e+02 -3.25841690e-03 7.71513216e-03 4.59995668e+01
1716.lowfreq: -4.3796 -2.4091 -0.0033 -0.0033 -0.0020 9.0812 80.0991 129.4926 158.7591
frequency: 80.0974 129.4925 158.7584 228.1167 241.4665 265.7400 353.3796 373.5691 411.1780 441.6075 495.8776 527.7321 554.6964 594.3671 623.1867 662.8606 751.2719 791.6859 793.2506 830.2010 845.0255 877.1992 913.6715 940.5298 969.4283 979.5717 1062.0009 1072.6489 1142.8476 1161.9908 1199.5789 1226.0055 1258.5930 1335.7699 1389.9751 1407.6339 1415.4973 1444.0739 1496.3511 1567.6378 1591.5463 1627.7048 3135.4975 3154.9984 3156.3464 3157.0365 3174.7878 3177.6183
redmass: 8.6522 4.7861 16.6003 4.3864 10.2241 5.3687 10.5239 10.7718 3.1823 4.6648 3.3293 7.5210 4.5786 7.5164 3.2435 7.2525 1.8651 5.3874 1.5377 1.6743 6.0870 1.4276 1.4998 6.5496 1.3325 1.3588 2.2989 2.1707 1.6899 1.2300 1.5433 1.8245 1.5963 1.9072 3.5502 5.0735 3.7070 2.5346 4.0398 8.1742 6.1718 7.3484 1.0872 1.0926 1.0894 1.0925 1.0978 1.0975
irintensity: 0.1363 0.8517 0.5278 3.0815 0.4741 0.4427 4.3156 8.6889 9.0645 0.6574 7.0025 1.9656 1.4267 25.5829 0.6389 7.9613 16.0981 25.1296 42.7382 47.7637 22.2297 26.8259 6.5421 77.1453 0.5059 3.1948 11.1601 25.0152 1.7195 2.6116 9.6860 24.0995 11.3128 18.9744 2.9858 1.4778 28.9813 18.4190 19.9048 45.0497 18.9731 29.1499 1.6032 4.7986 3.9693 7.9582 8.4298 2.1577
temp: 298.150 k
press: 1.00000 atm
elementType: 17 17 6 6 6 6 6 6 6 6 6 6 1 1 1 1 1 1
symmnumber: 1
zpe: 330110.1 jmol-1
zpe.correction: 0.125732 hartree
zpe.thermalcorrener: 0.135272 hartree
zpe.thermalcorrenthalpy: 0.136217 hartree
zpe.thermalcorrgfe: 0.089953 hartree
zpe.sumelectzpe: -1303.974759 hartree
zpe.sumelectthermal: -1303.965219 hartree
zpe.sumelectthermalent: -1303.964275 hartree
zpe.sumelectthermalfe: -1304.010539 hartree
dipole: 0.9257 1.6179 0.0002
dipole: 1.8640
quadrupole: -86.4180 -72.0620 -87.3800
quadrupole: 4.6117 0.0007 0.0012
quadrupole: -4.4646 9.8914 -5.4267 4.6117 0.0007 0.0012
hfenergy: -1304.1004917 hartree
pointgroup: C01 [X(C10H6Cl2)]
dipole: 0.4639363 -0.5679645 -0.0000753 debye
dipolederiv: -0.2832829 -0.2345183 -0.0000254 -0.3606825 -0.6536621 -0.0000634 -0.000029 -0.0000447 -0.0642021 -0.9461569 -0.0391511 -0.0000216 -0.1339625 -0.1275853 -0.0000077 -0.0000329 -0.0000059 -0.0666719 -0.1000422 -0.1462665 -0.0000111 -0.1918453 -0.301701 -0.000039 -0.0000119 -0.0000322 0.0448304 0.2180222 -0.1076521 -0.0000058 0.0170307 0.0010385 -0.0000009 -0.0000064 -0.0000051 0.0561849 0.0633821 0.0682631 0.0000097 -0.1020506 0.0480574 0.0000108 -0.0000069 0.0000162 -0.1373357 -0.4039274 0.0490916 0. 0.0685454 -0.0277128 0.0000101 -0.0000013 0.0000106 -0.1273115 0.4267822 0.3550816 0.0000381 0.6066251 0.9677951 0.0001148 0.0000599 0.0000832 -0.0776596 -0.1473592 0.0547604 -0.0000008 0.0115452 0.0660699 0.0000183 0.0000088 0.0000288 -0.1779282 -0.3576887 -0.1303523 -0.0000177 -0.0767547 0.03066 0.000009 -0.0000209 0.0000131 -0.108029 1.3833122 0.1427196 0.000043 0.202404 0.169236 0.0000215 0.0000558 0.0000208 -0.0643307 -0.0820446 0.0361701 -0.0000029 -0.0556922 -0.3175673 -0.0000216 -0.0000102 -0.0000153 -0.111049 0.0451775 -0.0102397 -0.0000061 -0.0089358 0.153735 0.0000363 -0.0000075 0.0000349 -0.1499861 0.073135 -0.0648041 -0.0000064 -0.0075103 -0.0038847 -0.0000117 -0.0000029 -0.0000165 0.1600929 0.0700399 -0.0184394 -0.0000031 -0.0581152 -0.0216672 -0.0000161 -0.0000066 -0.0000172 0.1649992 0.0529117 -0.0959585 -0.0000078 -0.0292082 -0.0614291 -0.0000192 -0.000002 -0.0000272 0.1625572 0.0313021 0.0748002 0.0000054 0.0618552 0.021817 -0.0000105 0.0000052 -0.0000108 0.1641442 -0.0427009 -0.0262756 0. -0.0325202 0.0969466 -0.0000087 0.0000005 -0.00001 0.1685321 -0.0008621 0.0927712 0.0000127 0.0892719 -0.040146 -0.000022 0.0000084 -0.0000226 0.163163 unknown
polarizability: 197.6138321|-1.79813|139.3722377|0.0019448|0.0081461|45.9995668 unknown
InChI: InChI=1S/C10H6Cl2/c11-8-4-5-9-7(6-8)2-1-3-10(9)12/h1-6H
charge 0 multiplicity 1
18 atoms
Cl 2.550656 2.333697 0.000302
Cl -4.174087 -0.251621 -0.00007
C  0.417876 0.48891 0.000093
C  -0.096456 -0.871433 -0.000033
C  -0.510285 1.581388 0.000139
C  -1.515887 -1.07981 -0.000074
C  1.843632 0.647655 0.000145
C  0.815186 -1.978808 -0.000109
C  -1.88739 1.35671 0.000106
C  -2.371456 0.015165 -0.000004
C  2.721674 -0.432321 0.000017
C  2.193087 -1.761732 -0.000123
H  -0.124515 2.605104 0.00022
H  -1.910519 -2.100845 -0.000162
H  0.412713 -2.997766 -0.000198
H  -2.594136 2.1914 0.00017
H  3.802504 -0.26514 0.000013
H  2.888701 -2.607254 -0.000231
