program: Gaussian 09
title: 000074913
version: EM64L-G09RevD.01
frameworkgroup: C1[X(C11H22O3)]
method: RPBEPBE
basis: SDD
operation: Freq
keyword: #pfreq=noraman
keyword: PBEPBE/SDD
title: #p freq=noraman PBEPBE/SDD
converged: YES YES NO NO
title: Mulliken charges:
elementType: O O O C C C C C C C C C C C H H H H H H H H H H H H H H H H H H H H H H
charge: -0.241799 -0.241807 -0.281101 -0.035950 -0.035954 -0.408585 -0.408580 -0.317520 -0.317522 -0.709938 -0.709634 -0.709918 -0.709651 0.308654 0.207992 0.207994 0.218126 0.218258 0.218136 0.218252 0.240746 0.240722 0.240772 0.240707 0.214861 0.210787 0.216340 0.210643 0.214851 0.216316 0.214864 0.210772 0.216339 0.210657 0.214850 0.216318
chargesum: 0.00000
title: Mulliken charges with hydrogens summed into heavy atoms:
elementType: O O O C C C C C C C C C C C
charge: -0.241799 -0.241807 -0.281101 0.172042 0.172041 0.027799 0.027808 0.163947 0.163958 -0.067949 -0.067824 -0.067943 -0.067826 0.308654
polarizability: 1.72887871e+02 5.07336607e-02 1.10989658e+02 -6.22879837e-04 7.23309683e-03 1.13830464e+02
1716.lowfreq: -0.0009 -0.0006 0.0005 3.8036 8.2998 17.3188 19.1948 35.5578 46.5119
frequency: 19.1374 35.4633 44.0371 47.6832 51.1425 96.9802 102.3524 120.3183 126.1051 153.5423 182.2141 220.1136 221.3567 234.8388 235.7340 268.6293 284.6627 319.8444 355.3317 355.4027 362.3458 376.8872 456.9275 539.0088 598.5836 662.4820 700.7770 778.2632 779.1947 784.6840 798.3003 879.3841 892.1135 918.5961 918.6467 952.8548 953.0192 966.9261 969.0942 985.9132 986.4644 1007.6543 1022.5006 1050.2556 1139.1196 1142.6256 1150.7046 1152.8591 1183.7369 1194.3485 1196.8212 1213.1359 1215.9875 1281.5239 1282.3714 1286.7476 1287.1961 1333.8778 1333.9279 1339.3042 1343.9733 1382.0234 1383.3902 1383.4354 1390.6419 1401.3371 1401.4274 1461.3897 1461.9549 1466.2772 1466.3387 1479.0928 1479.1204 1482.9025 1483.2183 1487.7594 1487.7715 1491.1244 1491.1934 1616.5775 2969.7747 2969.8033 2971.5898 2971.6243 2974.6464 2974.6771 2993.0828 2993.2798 3013.2541 3013.6377 3043.2161 3043.2544 3064.0291 3064.0496 3068.5100 3068.5380 3071.4648 3071.5438 3073.1396 3073.3776 3085.7362 3086.4132
redmass: 4.2793 2.4566 5.5565 3.1940 4.4765 1.7947 2.0776 4.1522 2.7497 3.8825 4.1501 1.1366 1.1956 1.0432 1.0440 3.8215 3.6872 5.4125 2.0803 2.0812 2.2171 2.3366 3.3704 2.5281 3.2549 9.9199 10.8809 1.1521 1.1642 3.2332 3.0535 7.2261 6.3291 1.2024 1.2030 1.2656 1.2667 1.9947 2.0816 1.7478 1.7456 2.2182 1.9317 5.2440 2.0491 1.9935 1.7980 1.8342 4.2732 1.9404 2.1263 1.2004 1.1871 1.1138 1.1121 1.5813 1.5597 1.4606 1.4603 1.3126 1.3385 1.4321 1.2087 1.2086 1.4932 1.2219 1.2210 1.0898 1.0899 1.0444 1.0443 1.0543 1.0541 1.0765 1.0769 1.0527 1.0550 1.0550 1.0553 10.2935 1.0801 1.0801 1.0354 1.0354 1.0362 1.0362 1.0639 1.0640 1.0565 1.0566 1.1023 1.1023 1.1000 1.0999 1.1003 1.1003 1.0988 1.0988 1.0988 1.0987 1.1082 1.1083
irintensity: 0.3595 0.0003 0.0009 0.0008 0.7677 0.0001 0.0683 0.4408 9.2139 0.3647 0.0002 0.0472 0.0001 0.2460 0.0057 0.1772 0.7452 34.1205 0.1900 0.0009 0.0123 4.1766 2.1191 6.3268 0.8388 3.4962 19.6204 0.0006 3.8405 0.0775 9.8600 14.3654 142.6754 0.1277 4.9404 0.0000 0.0949 12.6456 0.0019 0.0000 0.0263 0.0843 42.0073 1.3044 112.2647 0.2735 0.0001 12.1512 889.5107 7.6331 122.6588 0.0009 0.2970 0.0012 0.3943 48.4681 1.1173 0.0165 3.1243 2.7510 6.2731 3.2487 1.0527 44.1890 2.5968 4.3635 22.7222 8.7063 0.2318 0.0010 1.6302 0.0267 6.1278 28.1067 11.5784 5.7515 10.4947 8.4502 23.0997 221.7015 22.6168 10.0402 0.0750 79.1107 5.1399 31.1470 0.2712 53.4897 21.9810 29.3754 0.1698 11.5534 0.0269 39.5491 0.0704 22.5846 6.4583 129.3914 202.1221 1.6875 0.0663 85.9503
temp: 298.150 k
press: 1.00000 atm
elementType: 8 8 8 6 6 6 6 6 6 6 6 6 6 6 1 1 1 1 1 1 1 1 1 1 1 1 1 1 1 1 1 1 1 1 1 1
symmnumber: 1
zpe: 826916.5 jmol-1
zpe.correction: 0.314956 hartree
zpe.thermalcorrener: 0.333033 hartree
zpe.thermalcorrenthalpy: 0.333978 hartree
zpe.thermalcorrgfe: 0.266622 hartree
zpe.sumelectzpe: -656.878118 hartree
zpe.sumelectthermal: -656.860041 hartree
zpe.sumelectthermalent: -656.859096 hartree
zpe.sumelectthermalfe: -656.926452 hartree
dipole: -0.0003 -0.0002 -0.4079
dipole: 0.4079
quadrupole: -67.5784 -86.5072 -94.1814
quadrupole: 0.0091 -0.0003 -0.0109
quadrupole: 15.1773 -3.7515 -11.4258 0.0091 -0.0003 -0.0109
hfenergy: -657.193074 hartree
pointgroup: C01 [X(C11H22O3)]
dipole: -0.0001122 0.0000672 0.1604681 debye
polarizability: 172.8866274|-0.2820722|110.9909015|0.0006499|0.0072307|113.8304638 unknown
InChI: InChI=1S/C11H22O3/c1-9(2)5-7-13-11(12)14-8-6-10(3)4/h9-10H,5-8H2,1-4H3
charge 0 multiplicity 1
36 atoms
O  1.116078 -0.004717 0.578468
O  -1.11636 0.007382 0.578465
O  -0.000142 -0.001523 -1.490189
C  4.960808 -0.016125 0.357617
C  -4.961124 0.017462 0.357519
C  3.509393 -0.010033 0.92058
C  -3.509712 0.012922 0.920509
C  2.422253 -0.013146 -0.154948
C  -2.422574 0.01358 -0.155016
C  5.273561 -1.296541 -0.456451
C  5.28111 1.257284 -0.464429
C  -5.274253 1.29622 -0.458993
C  -5.281008 -1.257616 -0.462105
C  -0.000148 0.000289 -0.236088
H  5.628207 -0.015301 1.244588
H  -5.628537 0.01813 1.244481
H  3.367909 0.883283 1.558991
H  3.36404 -0.896034 1.568239
H  -3.368109 -0.87882 1.561091
H  -3.364492 0.900519 1.566006
H  2.458041 0.879033 -0.804812
H  2.452413 -0.913676 -0.7935
H  -2.458094 -0.880265 -0.802592
H  -2.452925 0.912476 -0.795857
H  6.345866 -1.3381 -0.722775
H  4.698234 -1.327846 -1.400804
H  5.031067 -2.208849 0.120214
H  4.704336 1.287303 -1.40794
H  6.353218 1.28978 -0.732803
H  5.046012 2.174542 0.10741
H  -6.346554 1.336923 -0.725475
H  -4.698869 1.325956 -1.403367
H  -5.032108 2.209697 0.115965
H  -4.704233 -1.289203 -1.40556
H  -6.353107 -1.290973 -0.730401
H  -5.045594 -2.173714 0.111464
