program: Orca
programVersion: 5.0.2
elementType: O O O C C C C C C C C C C C C C C C C C C C C C C C H H H H H H H H H H H H H H H H H H H H H H H H H H
charge: 0
multiplicity: 1
keywords: wb97x-d3
keywords: def2-TZVPP
keywords: def2/J RIJCOSX
keywords: DEFGRID2
keywords: scfconv7
keywords: smallprint printgap noloewdin
keywords: NOSOSCF
formula: C23H26O3
InChI: InChI=1/C23H26O3/c1-16(2)13-20-21(23(20,3)4)22(24)25-15-17-9-8-12-19(14-17)26-18-10-6-5-7-11-18/h5-14,20-21H,15H2,1-4H3
52 atoms
O  0.399095 -2.689691 0.331022
O  -0.408402 -0.747636 1.092975
O  3.45844 2.226483 -0.278472
C  -3.153987 -2.252705 0.93339
C  -2.988585 -1.403363 -0.2899
C  -1.882744 -2.360798 0.113688
C  -4.069346 -3.453514 0.890169
C  -3.14866 -1.572292 2.280748
C  -3.728246 -1.642692 -1.542481
C  -0.58675 -1.817307 0.571782
C  -4.305416 -0.725626 -2.322583
C  -5.007647 -1.126717 -3.586214
C  -4.319848 0.747583 -2.047498
C  1.725129 -2.273907 0.651623
C  2.232718 -1.226982 -0.299227
C  2.608939 0.017657 0.180403
C  2.316946 -1.497156 -1.661256
C  3.054551 0.995926 -0.698999
C  2.775991 -0.521019 -2.529778
C  3.140133 0.730491 -2.057355
C  2.800346 2.876638 0.724556
C  1.431876 2.757379 0.938268
C  3.562873 3.726024 1.515229
C  0.839244 3.489352 1.955825
C  2.953328 4.45944 2.520283
C  1.590418 4.342733 2.749894
H  -2.755073 -0.367627 -0.070221
H  -1.798062 -3.265357 -0.478344
H  -4.016879 -3.997323 -0.051875
H  -5.107014 -3.14877 1.036669
H  -3.811768 -4.154785 1.685608
H  -2.777887 -2.245446 3.056319
H  -4.16903 -1.292581 2.549647
H  -2.539468 -0.672603 2.300656
H  -3.794307 -2.67827 -1.862948
H  -4.986136 -2.204251 -3.745351
H  -4.549119 -0.651061 -4.457023
H  -6.053662 -0.810224 -3.574066
H  -3.852286 1.297358 -2.867839
H  -3.808813 1.028123 -1.12964
H  -5.347345 1.112608 -1.975603
H  2.319761 -3.184688 0.576346
H  1.780052 -1.919045 1.683003
H  2.527434 0.229338 1.239011
H  2.020518 -2.465855 -2.043408
H  2.843118 -0.728687 -3.589473
H  3.48844 1.501464 -2.731845
H  0.828324 2.092769 0.334198
H  4.626554 3.808732 1.334279
H  -0.224585 3.385969 2.1235
H  3.552755 5.121232 3.131527
H  1.118408 4.91113 3.539698
totalener: -1117.84817134 hartree
nucrepener: 2236.72357230 hartree
electener: -3354.57174364 hartree
oneelecener: -5962.35342844 hartree
twoeener: 2607.78168480 hartree
kineticenergy: 1112.86148504 hartree
xcener: -110.234448417769 hartree
chargesum: -0.0000000
charge: -0.269321 -0.401567 -0.299930 0.085655 0.046275 -0.093661 -0.247435 -0.254784 -0.184108 0.362495 -0.054913 -0.201890 -0.235658 0.062625 0.020934 -0.163380 -0.219697 0.253276 -0.070692 -0.222445 0.277771 -0.176402 -0.231259 -0.109720 -0.082341 -0.155079 0.086156 0.068945 0.071029 0.093290 0.090238 0.083390 0.084599 0.098771 0.069400 0.075968 0.084579 0.083163 0.087188 0.082000 0.085279 0.113704 0.098540 0.121392 0.113640 0.123848 0.124040 0.133374 0.121928 0.126116 0.122075 0.122596
qa: -0.2693 -0.4016 -0.2999 0.0857 0.0463 -0.0937 -0.2474 -0.2548 -0.1841 0.3625 -0.0549 -0.2019 -0.2357 0.0626 0.0209 -0.1634 -0.2197 0.2533 -0.0707 -0.2224 0.2778 -0.1764 -0.2313 -0.1097 -0.0823 -0.1551 0.0862 0.0689 0.0710 0.0933 0.0902 0.0834 0.0846 0.0988 0.0694 0.0760 0.0846 0.0832 0.0872 0.0820 0.0853 0.1137 0.0985 0.1214 0.1136 0.1238 0.1240 0.1334 0.1219 0.1261 0.1221 0.1226
va: 2.1270 2.0973 2.1148 3.7346 3.7854 3.8607 3.9173 3.9129 3.9050 4.2054 3.8317 3.9341 3.9452 3.8598 3.6708 3.9206 4.0213 3.8393 3.9154 4.0561 3.7872 3.9339 4.0439 3.9482 3.9274 3.9660 1.0335 1.0391 1.0106 1.0036 1.0044 1.0031 1.0003 1.0238 1.0223 1.0123 0.9981 0.9984 0.9989 1.0161 0.9991 0.9889 1.0116 1.0156 1.0162 0.9990 1.0134 1.0113 1.0157 0.9999 0.9991 1.0010
dispcorr: -0.023515387 hartree
energy: -1117.871686724847
dipole: -31.91895 31.34615 -0.57280 -8.63704 8.04244 -0.59460 -3.87601 3.70097 -0.17504
magnitude: 0.84397 au
magnitude: 2.14520 debye
