program: Orca
programVersion: 5.0.2
elementType: O O O C C C C C C C C C C C C C C C C C C C C C C C H H H H H H H H H H H H H H H H H H H H H H H H H H
charge: 0
multiplicity: 1
keywords: wb97x-d3
keywords: def2-TZVPP
keywords: def2/J RIJCOSX
keywords: DEFGRID2
keywords: scfconv7
keywords: smallprint printgap noloewdin
keywords: NOSOSCF
formula: C23H26O3
InChI: InChI=1/C23H26O3/c1-16(2)13-20-21(23(20,3)4)22(24)25-15-17-9-8-12-19(14-17)26-18-10-6-5-7-11-18/h5-14,20-21H,15H2,1-4H3
52 atoms
O  -0.004155 -2.332709 1.02674
O  -0.386811 -1.985508 -1.149292
O  3.001694 1.757361 1.158675
C  -2.46307 0.030704 0.228065
C  -3.13408 -1.064929 -0.53325
C  -2.059878 -1.416247 0.466105
C  -3.205019 0.688099 1.367038
C  -1.533697 0.969368 -0.501503
C  -4.549615 -1.440559 -0.281964
C  -0.756772 -1.92715 -0.007527
C  -5.036388 -2.681619 -0.316608
C  -6.488076 -2.956122 -0.064165
C  -4.197573 -3.88791 -0.610646
C  1.304709 -2.790921 0.719044
C  2.221674 -1.684268 0.276658
C  2.184997 -0.444239 0.905937
C  3.126443 -1.898116 -0.752698
C  3.047687 0.559028 0.501482
C  3.999278 -0.891901 -1.139495
C  3.965257 0.344687 -0.518851
C  2.644625 2.877904 0.472491
C  2.996959 4.09351 1.047341
C  1.936273 2.84801 -0.723344
C  2.641139 5.276704 0.423051
C  1.592556 4.043716 -1.338418
C  1.941765 5.26095 -0.775955
H  -2.808239 -1.15606 -1.56702
H  -2.387477 -1.828531 1.414139
H  -3.854657 -0.007971 1.897652
H  -3.826408 1.508236 1.001199
H  -2.503478 1.105752 2.090744
H  -0.772575 1.372692 0.169652
H  -2.0999 1.814981 -0.896462
H  -1.024942 0.493965 -1.337868
H  -5.239276 -0.624844 -0.083447
H  -7.047844 -2.045104 0.144224
H  -6.617449 -3.631474 0.785295
H  -6.951737 -3.446136 -0.923882
H  -4.596648 -4.429203 -1.472041
H  -4.213649 -4.588337 0.228336
H  -3.160185 -3.643228 -0.82685
H  1.273199 -3.579024 -0.03728
H  1.665367 -3.234359 1.648561
H  1.483792 -0.244921 1.706901
H  3.142864 -2.851606 -1.265247
H  4.703315 -1.068407 -1.941705
H  4.63754 1.136749 -0.822543
H  3.546352 4.101123 1.979631
H  1.648986 1.908068 -1.176113
H  2.920357 6.218717 0.876433
H  1.041506 4.014663 -2.269282
H  1.671037 6.187197 -1.263918
totalener: -1117.84625350 hartree
nucrepener: 2264.08576842 hartree
electener: -3381.93202192 hartree
oneelecener: -6016.94191320 hartree
twoeener: 2635.00989128 hartree
kineticenergy: 1112.86218535 hartree
xcener: -110.233227924478 hartree
chargesum: -0.0000000
charge: -0.270802 -0.367980 -0.300672 0.146284 -0.014138 -0.120475 -0.276351 -0.273258 -0.242796 0.319099 -0.007128 -0.210695 -0.224250 0.065106 0.067116 -0.268508 -0.142715 0.225473 -0.106645 -0.151857 0.279641 -0.210947 -0.198302 -0.093520 -0.132859 -0.147665 0.106333 0.087007 0.085084 0.090599 0.093561 0.087302 0.090068 0.097730 0.093627 0.078381 0.084062 0.086485 0.090034 0.085616 0.081849 0.100048 0.107210 0.121158 0.103947 0.125804 0.132664 0.122792 0.135371 0.123301 0.125177 0.123633
qa: -0.2708 -0.3680 -0.3007 0.1463 -0.0141 -0.1205 -0.2764 -0.2733 -0.2428 0.3191 -0.0071 -0.2107 -0.2243 0.0651 0.0671 -0.2685 -0.1427 0.2255 -0.1066 -0.1519 0.2796 -0.2109 -0.1983 -0.0935 -0.1329 -0.1477 0.1063 0.0870 0.0851 0.0906 0.0936 0.0873 0.0901 0.0977 0.0936 0.0784 0.0841 0.0865 0.0900 0.0856 0.0818 0.1000 0.1072 0.1212 0.1039 0.1258 0.1327 0.1228 0.1354 0.1233 0.1252 0.1236
va: 2.1143 2.1317 2.0983 3.7472 3.8257 3.8187 3.9046 3.8978 3.9023 4.2226 3.7356 3.9416 3.9387 3.8625 3.6427 4.0400 4.0164 3.8394 3.9491 3.9960 3.7698 4.0264 3.8978 3.9449 3.9764 3.9625 1.0266 1.0312 1.0045 1.0015 1.0067 1.0014 1.0062 1.0156 1.0090 1.0098 0.9992 0.9988 1.0021 1.0007 1.0199 1.0097 0.9882 1.0287 1.0129 1.0005 1.0026 1.0151 1.0044 0.9987 1.0008 1.0004
dispcorr: -0.026030307 hartree
energy: -1117.872283811596
dipole: -28.51402 28.22529 -0.28874 -6.11068 5.92271 -0.18797 -1.85587 2.03168 0.17581
magnitude: 0.38679 au
magnitude: 0.98315 debye
