program: Orca
programVersion: 5.0.2
elementType: O O O C C C C C C C C C C C C C C C C C C C C C C C H H H H H H H H H H H H H H H H H H H H H H H H H H
charge: 0
multiplicity: 1
keywords: wb97x-d3
keywords: def2-TZVPP
keywords: def2/J RIJCOSX
keywords: DEFGRID2
keywords: scfconv7
keywords: smallprint printgap noloewdin
keywords: NOSOSCF
formula: C23H26O3
InChI: InChI=1/C23H26O3/c1-16(2)13-20-21(23(20,3)4)22(24)25-15-17-9-8-12-19(14-17)26-18-10-6-5-7-11-18/h5-14,20-21H,15H2,1-4H3
52 atoms
O  0.034479 -1.895723 -1.756668
O  -0.759587 -0.046139 -0.779968
O  3.920726 1.79741 0.732922
C  -2.309136 -2.292226 0.832648
C  -3.240443 -1.512426 -0.05172
C  -1.984235 -2.099121 -0.638234
C  -2.69824 -3.689277 1.250562
C  -1.524315 -1.552434 1.888275
C  -4.557806 -2.044664 -0.466881
C  -0.87356 -1.212183 -1.046897
C  -5.74879 -1.568632 -0.098892
C  -7.018571 -2.1914 -0.596476
C  -5.939788 -0.400387 0.819702
C  1.237094 -1.206598 -2.082277
C  2.081715 -0.94254 -0.865902
C  2.593314 0.327004 -0.646408
C  2.357563 -1.965197 0.036047
C  3.367353 0.580068 0.478951
C  3.136057 -1.70531 1.151818
C  3.640242 -0.435327 1.383743
C  3.274583 2.949036 0.386573
C  4.061752 3.991007 -0.083055
C  1.90341 3.116347 0.542609
C  3.474753 5.207579 -0.393493
C  1.32937 4.335693 0.217327
C  2.106899 5.385196 -0.25004
H  -3.19113 -0.43774 0.091506
H  -2.094832 -2.988532 -1.250041
H  -1.814079 -4.267385 1.524731
H  -3.220993 -4.235242 0.466267
H  -3.358454 -3.656753 2.119105
H  -0.571356 -2.046642 2.087769
H  -2.089948 -1.536777 2.821603
H  -1.31075 -0.522511 1.61282
H  -4.543445 -2.903246 -1.132559
H  -7.636749 -2.541602 0.234057
H  -6.8303 -3.039144 -1.25416
H  -7.622276 -1.467177 -1.149168
H  -5.005035 0.025901 1.177161
H  -6.521907 -0.695597 1.69631
H  -6.5051 0.394088 0.32635
H  1.021323 -0.275065 -2.610219
H  1.754561 -1.872343 -2.774269
H  2.366576 1.122544 -1.34513
H  1.961794 -2.959392 -0.127345
H  3.350666 -2.498033 1.856345
H  4.242183 -0.224997 2.257802
H  5.127699 3.843358 -0.196219
H  1.283328 2.305487 0.902881
H  4.092551 6.018393 -0.756446
H  0.261239 4.461881 0.334426
H  1.650263 6.333349 -0.499511
totalener: -1117.84724085 hartree
nucrepener: 2224.76855662 hartree
electener: -3342.61579747 hartree
oneelecener: -5938.39057770 hartree
twoeener: 2595.77478023 hartree
kineticenergy: 1112.85849662 hartree
xcener: -110.232981487453 hartree
chargesum: 0.0000000
charge: -0.267736 -0.379247 -0.299270 0.120692 0.014601 -0.110652 -0.235525 -0.259899 -0.198530 0.324965 -0.031477 -0.209465 -0.236472 0.063127 0.061677 -0.170766 -0.261682 0.253693 -0.060110 -0.224378 0.262855 -0.221588 -0.176077 -0.087209 -0.111964 -0.150227 0.092266 0.072313 0.090265 0.073054 0.089316 0.082837 0.087043 0.096188 0.078827 0.083521 0.077084 0.085650 0.081980 0.084469 0.088044 0.100416 0.109234 0.115014 0.116968 0.123844 0.123978 0.122643 0.140029 0.124126 0.127593 0.123962
qa: -0.2677 -0.3792 -0.2993 0.1207 0.0146 -0.1107 -0.2355 -0.2599 -0.1985 0.3250 -0.0315 -0.2095 -0.2365 0.0631 0.0617 -0.1708 -0.2617 0.2537 -0.0601 -0.2244 0.2629 -0.2216 -0.1761 -0.0872 -0.1120 -0.1502 0.0923 0.0723 0.0903 0.0731 0.0893 0.0828 0.0870 0.0962 0.0788 0.0835 0.0771 0.0857 0.0820 0.0845 0.0880 0.1004 0.1092 0.1150 0.1170 0.1238 0.1240 0.1226 0.1400 0.1241 0.1276 0.1240
va: 2.1207 2.1247 2.1120 3.7331 3.7878 3.8943 3.9026 3.9093 3.8982 4.2707 3.7757 3.9387 3.9480 3.8625 3.6534 3.9432 3.9989 3.8455 3.8978 4.0522 3.7943 4.0450 3.9454 3.9268 3.9464 3.9614 1.0323 1.0393 1.0048 1.0097 1.0060 1.0063 1.0029 1.0196 1.0176 0.9986 1.0116 0.9978 1.0129 0.9997 0.9996 1.0113 0.9886 1.0155 1.0187 0.9984 1.0135 1.0152 1.0031 0.9989 0.9995 1.0006
dispcorr: -0.024478107 hartree
energy: -1117.871718954635
dipole: -32.95654 32.44903 -0.50752 -12.59878 12.06479 -0.53400 6.07153 -6.10877 -0.03725
magnitude: 0.73764 au
magnitude: 1.87493 debye
