program: Orca
programVersion: 5.0.2
elementType: O O O C C C C C C C C C C C C C C C C C C C C C C C H H H H H H H H H H H H H H H H H H H H H H H H H H
charge: 0
multiplicity: 1
keywords: wb97x-d3
keywords: def2-TZVPP
keywords: def2/J RIJCOSX
keywords: DEFGRID2
keywords: scfconv7
keywords: smallprint printgap noloewdin
keywords: NOSOSCF
formula: C23H26O3
InChI: InChI=1/C23H26O3/c1-16(2)13-20-21(23(20,3)4)22(24)25-15-17-9-8-12-19(14-17)26-18-10-6-5-7-11-18/h5-14,20-21H,15H2,1-4H3
52 atoms
O  0.479401 -2.783191 -0.563713
O  -0.379524 -2.307849 1.451112
O  2.681465 1.701972 1.541191
C  -3.067758 -3.042064 -0.03752
C  -2.933937 -1.571059 0.160166
C  -1.792564 -2.338477 -0.474884
C  -3.935126 -3.553024 -1.163392
C  -3.065613 -3.9444 1.172193
C  -3.707256 -0.584561 -0.636663
C  -0.521713 -2.470232 0.265723
C  -3.242237 0.593166 -1.056249
C  -4.101163 1.537817 -1.84071
C  -1.84969 1.074147 -0.784071
C  1.805267 -2.834276 -0.030919
C  2.483468 -1.501837 -0.178116
C  2.281336 -0.495464 0.763982
C  3.280182 -1.245451 -1.286605
C  2.874341 0.742477 0.586491
C  3.8783 -0.004339 -1.450771
C  3.678091 0.997799 -0.517495
C  2.022692 2.845131 1.201684
C  1.17185 2.935795 0.1062
C  2.212362 3.942878 2.032908
C  0.520193 4.133186 -0.151792
C  1.550406 5.128763 1.764024
C  0.704953 5.234962 0.667851
H  -2.73193 -1.27685 1.187711
H  -1.67622 -2.229017 -1.547188
H  -3.595198 -4.535957 -1.494033
H  -3.926521 -2.891362 -2.029673
H  -4.97145 -3.656321 -0.835059
H  -2.457107 -3.557441 1.986041
H  -2.694788 -4.939188 0.917128
H  -4.08485 -4.059858 1.54565
H  -4.738804 -0.841338 -0.861902
H  -4.207556 2.494277 -1.322891
H  -5.099407 1.137519 -2.014412
H  -3.653114 1.75852 -2.813054
H  -1.273046 0.3947 -0.160572
H  -1.867957 2.043422 -0.279484
H  -1.300704 1.22075 -1.718982
H  2.322818 -3.590435 -0.621155
H  1.7925 -3.161521 1.009116
H  1.663641 -0.671258 1.635416
H  3.438932 -2.020712 -2.026151
H  4.507597 0.182978 -2.310646
H  4.141976 1.968306 -0.638724
H  1.009069 2.084996 -0.542018
H  2.874043 3.856778 2.885129
H  -0.141275 4.196732 -1.006533
H  1.703583 5.979315 2.415284
H  0.194433 6.164967 0.458268
totalener: -1117.84664366 hartree
nucrepener: 2281.23622847 hartree
electener: -3399.08287212 hartree
oneelecener: -6051.13854861 hartree
twoeener: 2652.05567649 hartree
kineticenergy: 1112.85148358 hartree
xcener: -110.230641776355 hartree
chargesum: -0.0000000
charge: -0.258791 -0.402956 -0.298306 0.132479 -0.018504 -0.114700 -0.273797 -0.261274 -0.243419 0.348553 0.009552 -0.215882 -0.247756 0.046310 0.001165 -0.192528 -0.158188 0.197742 -0.111627 -0.144072 0.259075 -0.153450 -0.203166 -0.157765 -0.094811 -0.144850 0.106822 0.085121 0.091478 0.084732 0.090138 0.101523 0.085139 0.084113 0.092883 0.088347 0.079667 0.083948 0.085241 0.094648 0.089759 0.097791 0.116396 0.143399 0.108631 0.127141 0.132324 0.131742 0.124040 0.128831 0.123519 0.123595
qa: -0.2588 -0.4030 -0.2983 0.1325 -0.0185 -0.1147 -0.2738 -0.2613 -0.2434 0.3486 0.0096 -0.2159 -0.2478 0.0463 0.0012 -0.1925 -0.1582 0.1977 -0.1116 -0.1441 0.2591 -0.1534 -0.2032 -0.1578 -0.0948 -0.1449 0.1068 0.0851 0.0915 0.0847 0.0901 0.1015 0.0851 0.0841 0.0929 0.0883 0.0797 0.0839 0.0852 0.0946 0.0898 0.0978 0.1164 0.1434 0.1086 0.1271 0.1323 0.1317 0.1240 0.1288 0.1235 0.1236
va: 2.1276 2.0881 2.1083 3.7282 3.8147 3.8160 3.9097 3.9032 3.9061 4.1975 3.7970 3.9390 3.9571 3.8491 3.6973 3.9737 4.0169 3.8780 3.9464 3.9888 3.8190 3.8843 4.0182 3.9665 3.9525 3.9656 1.0280 1.0333 1.0060 1.0049 1.0014 1.0202 1.0017 1.0026 1.0095 0.9985 1.0100 0.9989 1.0096 0.9988 0.9947 0.9981 1.0148 1.0272 1.0113 1.0002 1.0035 1.0016 1.0145 0.9990 0.9985 1.0004
dispcorr: -0.026151605 hartree
energy: -1117.872795263015
dipole: -24.76684 24.66136 -0.10548 -4.36984 4.39468 0.02484 -9.03142 8.03510 -0.99632
magnitude: 1.00220 au
magnitude: 2.54738 debye
