program: Orca
programVersion: 5.0.2
elementType: O O O C C C C C C C C C C C C C C C C C C C C C C C H H H H H H H H H H H H H H H H H H H H H H H H H H
charge: 0
multiplicity: 1
keywords: wb97x-d3
keywords: def2-TZVPP
keywords: def2/J RIJCOSX
keywords: DEFGRID2
keywords: scfconv7
keywords: smallprint printgap noloewdin
keywords: NOSOSCF
formula: C23H26O3
InChI: InChI=1/C23H26O3/c1-16(2)13-20-21(23(20,3)4)22(24)25-15-17-9-8-12-19(14-17)26-18-10-6-5-7-11-18/h5-14,20-21H,15H2,1-4H3
52 atoms
O  0.193325 -2.175302 -1.581188
O  -0.520519 -0.130685 -1.018537
O  3.786293 1.777832 0.57452
C  -2.181984 -1.841699 1.038617
C  -3.063202 -1.297733 -0.04779
C  -1.808717 -2.053193 -0.418054
C  -2.613443 -3.07342 1.798359
C  -1.407541 -0.869071 1.894376
C  -4.383966 -1.87285 -0.366391
C  -0.673516 -1.324398 -1.022679
C  -5.53372 -1.207463 -0.498036
C  -6.803714 -1.930811 -0.835322
C  -5.68413 0.27415 -0.331618
C  1.415098 -1.621832 -2.07045
C  2.315827 -1.219535 -0.936914
C  2.639298 0.114114 -0.740854
C  2.792837 -2.183587 -0.053871
C  3.420582 0.486163 0.34611
C  3.586858 -1.806877 1.01595
C  3.896873 -0.47205 1.227816
C  2.898412 2.803303 0.433035
C  3.445242 4.053176 0.170432
C  1.524732 2.657128 0.585788
C  2.616028 5.156842 0.060556
C  0.707454 3.770841 0.46067
C  1.242174 5.022888 0.199871
H  -2.970385 -0.226623 -0.189105
H  -1.934438 -3.068753 -0.777826
H  -1.751019 -3.559795 2.257134
H  -3.10837 -3.811441 1.168765
H  -3.308744 -2.804788 2.595612
H  -1.162055 0.052668 1.372468
H  -0.474071 -1.313926 2.245329
H  -1.998444 -0.605239 2.773544
H  -4.413159 -2.948679 -0.513194
H  -7.555823 -1.791529 -0.054546
H  -6.645995 -3.001477 -0.960039
H  -7.241528 -1.547227 -1.760406
H  -6.424311 0.499396 0.440166
H  -6.049213 0.731923 -1.254161
H  -4.761359 0.778257 -0.054973
H  1.220876 -0.778716 -2.736378
H  1.862233 -2.422864 -2.659198
H  2.255388 0.86338 -1.421377
H  2.540106 -3.226325 -0.200311
H  3.961428 -2.555414 1.701505
H  4.506316 -0.168488 2.068614
H  4.516976 4.151909 0.058085
H  1.083175 1.690201 0.786507
H  3.050087 6.126934 -0.142979
H  -0.36193 3.648572 0.570519
H  0.595774 5.884714 0.105119
totalener: -1117.84788278 hartree
nucrepener: 2252.00318518 hartree
electener: -3369.85106797 hartree
oneelecener: -5992.82744387 hartree
twoeener: 2622.97637591 hartree
kineticenergy: 1112.86369829 hartree
xcener: -110.234898536814 hartree
chargesum: -0.0000000
charge: -0.264100 -0.396184 -0.299043 0.092389 0.041808 -0.091227 -0.246819 -0.249433 -0.190374 0.345734 -0.047927 -0.204592 -0.236627 0.055623 0.013261 -0.168372 -0.215715 0.258006 -0.076806 -0.216604 0.279867 -0.225604 -0.168068 -0.088060 -0.120496 -0.147161 0.090254 0.071579 0.090844 0.071255 0.092387 0.079467 0.089968 0.088698 0.071271 0.083933 0.076148 0.084500 0.083753 0.087949 0.082809 0.102055 0.114376 0.125681 0.112953 0.124583 0.124766 0.121388 0.127885 0.122743 0.123128 0.122152
qa: -0.2641 -0.3962 -0.2990 0.0924 0.0418 -0.0912 -0.2468 -0.2494 -0.1904 0.3457 -0.0479 -0.2046 -0.2366 0.0556 0.0133 -0.1684 -0.2157 0.2580 -0.0768 -0.2166 0.2799 -0.2256 -0.1681 -0.0881 -0.1205 -0.1472 0.0903 0.0716 0.0908 0.0713 0.0924 0.0795 0.0900 0.0887 0.0713 0.0839 0.0761 0.0845 0.0838 0.0879 0.0828 0.1021 0.1144 0.1257 0.1130 0.1246 0.1248 0.1214 0.1279 0.1227 0.1231 0.1222
va: 2.1291 2.1044 2.1182 3.7408 3.7866 3.8613 3.9136 3.9190 3.9034 4.2483 3.8221 3.9355 3.9463 3.8635 3.6489 3.9293 4.0124 3.8277 3.9118 4.0554 3.8056 4.0289 3.9286 3.9353 3.9595 3.9619 1.0342 1.0381 1.0043 1.0105 1.0044 1.0214 1.0025 1.0034 1.0212 0.9982 1.0123 0.9980 0.9995 0.9988 1.0152 1.0109 0.9908 1.0164 1.0160 0.9989 1.0130 1.0160 1.0010 0.9989 1.0003 1.0008
dispcorr: -0.024785342 hartree
energy: -1117.872668124413
dipole: -32.42541 31.89268 -0.53274 -8.88960 8.23814 -0.65146 5.33302 -5.26560 0.06742
magnitude: 0.84425 au
magnitude: 2.14591 debye
