program: Orca
programVersion: 5.0.2
elementType: O O O C C C C C C C C C C C C C C C C C C C C C C C H H H H H H H H H H H H H H H H H H H H H H H H H H
charge: 0
multiplicity: 1
keywords: wb97x-d3
keywords: def2-TZVPP
keywords: def2/J RIJCOSX
keywords: DEFGRID2
keywords: scfconv7
keywords: smallprint printgap noloewdin
keywords: NOSOSCF
formula: C23H26O3
InChI: InChI=1/C23H26O3/c1-16(2)13-20-21(23(20,3)4)22(24)25-15-17-9-8-12-19(14-17)26-18-10-6-5-7-11-18/h5-14,20-21H,15H2,1-4H3
52 atoms
O  0.313629 -2.74752 0.34444
O  -0.383322 -0.859361 1.319852
O  3.175845 2.243608 -0.166946
C  -3.242334 -2.085494 0.950713
C  -2.943259 -1.184878 -0.196517
C  -1.946499 -2.271295 0.184035
C  -4.252689 -3.193003 0.765824
C  -3.240968 -1.511659 2.346553
C  -3.657725 -1.256617 -1.495032
C  -0.625888 -1.860546 0.696093
C  -3.157511 -0.840745 -2.659989
C  -3.952442 -0.92889 -3.927253
C  -1.78348 -0.260823 -2.806014
C  1.670516 -2.372715 0.578308
C  2.083075 -1.248911 -0.330933
C  2.472018 -0.029714 0.20084
C  2.027516 -1.41328 -1.711897
C  2.777933 1.030772 -0.642104
C  2.354165 -0.357322 -2.546041
C  2.719484 0.872046 -2.018081
C  2.520184 2.845443 0.867217
C  1.195636 2.582459 1.196425
C  3.241985 3.799514 1.573935
C  0.608028 3.275875 2.24428
C  2.636034 4.4911 2.609349
C  1.317484 4.231385 2.954633
H  -2.614152 -0.191068 0.096322
H  -1.920791 -3.133938 -0.471318
H  -4.075945 -3.993195 1.486277
H  -4.215357 -3.634212 -0.230058
H  -5.266919 -2.821799 0.927316
H  -2.989544 -2.276701 3.083454
H  -4.238223 -1.138214 2.587324
H  -2.539058 -0.690617 2.46522
H  -4.666721 -1.658245 -1.481692
H  -4.938926 -1.361104 -3.76413
H  -3.435832 -1.540314 -4.671327
H  -4.088158 0.057914 -4.376799
H  -1.834526 0.759603 -3.195647
H  -1.195296 -0.836271 -3.5262
H  -1.221978 -0.232328 -1.874376
H  2.24313 -3.276682 0.370098
H  1.82744 -2.105723 1.625395
H  2.501007 0.101574 1.275179
H  1.720602 -2.361864 -2.134469
H  2.312574 -0.483659 -3.619851
H  2.959428 1.706899 -2.663053
H  0.620035 1.838747 0.662265
H  4.271416 3.995058 1.30351
H  -0.420314 3.058873 2.501315
H  3.203911 5.234389 3.153326
H  0.849297 4.767734 3.76872
totalener: -1117.84645425 hartree
nucrepener: 2294.16389765 hartree
electener: -3412.01035190 hartree
oneelecener: -6077.20367106 hartree
twoeener: 2665.19331916 hartree
kineticenergy: 1112.86205821 hartree
xcener: -110.234016076699 hartree
chargesum: -0.0000000
charge: -0.265064 -0.402563 -0.299433 0.144634 -0.045964 -0.070637 -0.280250 -0.254363 -0.230224 0.326659 0.005393 -0.212675 -0.217139 0.066861 0.040059 -0.178016 -0.240302 0.257743 -0.077498 -0.208406 0.282160 -0.169493 -0.231520 -0.122284 -0.084796 -0.151048 0.101479 0.079660 0.091814 0.080760 0.093210 0.084312 0.083078 0.100386 0.094181 0.078540 0.084931 0.086983 0.091599 0.078752 0.068637 0.113183 0.099514 0.123878 0.113428 0.123542 0.124697 0.131729 0.120830 0.125083 0.122204 0.121752
qa: -0.2651 -0.4026 -0.2994 0.1446 -0.0460 -0.0706 -0.2802 -0.2544 -0.2302 0.3267 0.0054 -0.2127 -0.2171 0.0669 0.0401 -0.1780 -0.2403 0.2577 -0.0775 -0.2084 0.2822 -0.1695 -0.2315 -0.1223 -0.0848 -0.1510 0.1015 0.0797 0.0918 0.0808 0.0932 0.0843 0.0831 0.1004 0.0942 0.0785 0.0849 0.0870 0.0916 0.0788 0.0686 0.1132 0.0995 0.1239 0.1134 0.1235 0.1247 0.1317 0.1208 0.1251 0.1222 0.1218
va: 2.1226 2.0873 2.1151 3.7383 3.8553 3.7885 3.9141 3.8940 3.8884 4.2081 3.7441 3.9395 3.9518 3.8547 3.6213 3.9471 3.9829 3.8300 3.8839 4.0562 3.7882 3.9191 4.0362 3.9613 3.9313 3.9625 1.0248 1.0349 1.0065 1.0047 1.0002 1.0028 1.0015 1.0225 1.0097 1.0100 0.9987 0.9984 1.0023 1.0030 1.0155 0.9904 1.0109 1.0151 1.0176 0.9992 1.0121 1.0111 1.0161 1.0004 0.9990 1.0009
dispcorr: -0.026182331 hartree
energy: -1117.872636581838
dipole: -25.99777 25.55076 -0.44701 -9.30184 8.66866 -0.63318 -6.48967 6.08689 -0.40278
magnitude: 0.87348 au
magnitude: 2.22022 debye
