program: Orca
programVersion: 5.0.2
elementType: O O O C C C C C C C C C C C C C C C C C C C C C C C H H H H H H H H H H H H H H H H H H H H H H H H H H
charge: 0
multiplicity: 1
keywords: wb97x-d3
keywords: def2-TZVPP
keywords: def2/J RIJCOSX
keywords: DEFGRID2
keywords: scfconv7
keywords: smallprint printgap noloewdin
keywords: NOSOSCF
formula: C23H26O3
InChI: InChI=1/C23H26O3/c1-16(2)13-20-21(23(20,3)4)22(24)25-15-17-9-8-12-19(14-17)26-18-10-6-5-7-11-18/h5-14,20-21H,15H2,1-4H3
52 atoms
O  0.245925 -2.315864 -1.0330
O  -0.532427 -0.224541 -1.212581
O  3.805605 1.879509 0.192639
C  -2.30988 -1.095831 1.210641
C  -3.109269 -1.155902 -0.055911
C  -1.768711 -1.859759 0.016592
C  -2.723294 -1.931533 2.399262
C  -1.713127 0.230893 1.613436
C  -4.342285 -1.951008 -0.19062
C  -0.645924 -1.349005 -0.79792
C  -5.471911 -1.582456 -0.799458
C  -6.64741 -2.512108 -0.857959
C  -5.69387 -0.259949 -1.468052
C  1.42944 -1.960642 -1.752319
C  2.463209 -1.369277 -0.836079
C  2.635594 0.006421 -0.760713
C  3.241269 -2.204337 -0.039466
C  3.574156 0.537907 0.115272
C  4.183308 -1.666439 0.82112
C  4.350048 -0.292691 0.908896
C  2.761578 2.751741 0.292281
C  2.950753 4.015578 -0.250673
C  1.576022 2.437967 0.945541
C  1.951032 4.967618 -0.135305
C  0.581931 3.399118 1.045624
C  0.760338 4.665081 0.509078
H  -3.074131 -0.238452 -0.632706
H  -1.794377 -2.939361 0.115326
H  -3.084996 -2.920939 2.123303
H  -3.518906 -1.434785 2.957279
H  -1.878575 -2.071245 3.075699
H  -0.813176 0.084054 2.215309
H  -2.430896 0.780575 2.225537
H  -1.450579 0.854408 0.762346
H  -4.318097 -2.943852 0.248795
H  -6.446839 -3.460623 -0.361041
H  -6.926843 -2.728509 -1.892259
H  -7.526114 -2.065601 -0.385623
H  -5.941571 -0.39919 -2.522824
H  -4.838165 0.408097 -1.417221
H  -6.542956 0.258729 -1.016961
H  1.194417 -1.282483 -2.573831
H  1.787485 -2.8983 -2.177101
H  2.028603 0.660802 -1.37337
H  3.11183 -3.27804 -0.09672
H  4.790455 -2.318074 1.435415
H  5.079248 0.139116 1.581577
H  3.880153 4.244256 -0.755488
H  1.421249 1.455261 1.370878
H  2.104021 5.951098 -0.559745
H  -0.34073 3.149965 1.553428
H  -0.020739 5.408453 0.591917
totalener: -1117.84835529 hartree
nucrepener: 2256.11679832 hartree
electener: -3373.96515361 hartree
oneelecener: -6001.02846383 hartree
twoeener: 2627.06331023 hartree
kineticenergy: 1112.86026376 hartree
xcener: -110.233580909922 hartree
chargesum: -0.0000000
charge: -0.262947 -0.400684 -0.301641 0.107065 0.042692 -0.098567 -0.249525 -0.294971 -0.185352 0.370030 -0.053946 -0.202029 -0.236790 0.041351 -0.012181 -0.129347 -0.180887 0.211925 -0.093491 -0.201675 0.251692 -0.220908 -0.145606 -0.085414 -0.110384 -0.157932 0.091506 0.071538 0.072391 0.093068 0.091360 0.088369 0.091663 0.097958 0.069840 0.076062 0.084565 0.083003 0.086575 0.084016 0.084700 0.110211 0.108132 0.135004 0.109844 0.123907 0.125993 0.122578 0.123388 0.122809 0.129453 0.121586
qa: -0.2629 -0.4007 -0.3016 0.1071 0.0427 -0.0986 -0.2495 -0.2950 -0.1854 0.3700 -0.0539 -0.2020 -0.2368 0.0414 -0.0122 -0.1293 -0.1809 0.2119 -0.0935 -0.2017 0.2517 -0.2209 -0.1456 -0.0854 -0.1104 -0.1579 0.0915 0.0715 0.0724 0.0931 0.0914 0.0884 0.0917 0.0980 0.0698 0.0761 0.0846 0.0830 0.0866 0.0840 0.0847 0.1102 0.1081 0.1350 0.1098 0.1239 0.1260 0.1226 0.1234 0.1228 0.1295 0.1216
va: 2.1362 2.0966 2.1088 3.7217 3.7856 3.8834 3.9160 3.9225 3.9037 4.2085 3.8323 3.9337 3.9448 3.8713 3.6765 3.8903 4.0159 3.8578 3.9369 4.0496 3.8437 4.0363 3.9290 3.9405 3.9456 3.9929 1.0322 1.0376 1.0111 1.0036 1.0043 0.9970 1.0018 1.0154 1.0225 1.0123 0.9982 0.9983 0.9989 1.0164 0.9991 1.0109 0.9943 1.0231 1.0116 0.9995 1.0120 1.0149 1.0040 0.9985 0.9961 1.0019
dispcorr: -0.024993914 hartree
energy: -1117.873349207153
dipole: -33.08013 32.55957 -0.52055 -7.38055 6.75958 -0.62097 4.53923 -4.31308 0.22616
magnitude: 0.84126 au
magnitude: 2.13832 debye
