program: Orca
programVersion: 5.0.3
elementType: Cl Cl O O O C C C C C C C C C C C C C C C C C C C C C H H H H H H H H H H H H H H H H H H H H
charge: 0
multiplicity: 1
keywords: wb97x-d3
keywords: def2-TZVPP
keywords: def2/J RIJCOSX
keywords: DEFGRID2
keywords: scfconv7
keywords: smallprint printgap noloewdin
keywords: NOSOSCF
formula: C21H20Cl2O3
InChI: InChI=1/C21H20Cl2O3/c1-21(2)17(12-18(22)23)19(21)20(24)25-13-14-7-6-10-16(11-14)26-15-8-4-3-5-9-15/h3-12,17,19H,13H2,1-2H3
46 atoms
Cl 2.51629 -5.457766 0.322843
Cl 4.378435 -5.362523 -1.878125
O  -1.16637 -0.759558 -1.96488
O  -1.097644 -1.990345 -0.100716
O  -1.04033 3.39008 0.836053
C  1.92194 -1.028598 -0.339083
C  1.784786 -2.512154 -0.544398
C  0.910674 -1.564139 -1.334744
C  3.099814 -0.285334 -0.919698
C  1.46353 -0.458674 0.981251
C  2.799606 -3.290749 -1.262868
C  -0.534306 -1.489007 -1.045309
C  3.173251 -4.529748 -0.970323
C  -2.541225 -0.450917 -1.7235
C  -2.709692 0.490185 -0.562739
C  -1.827714 1.551247 -0.3854
C  -3.76746 0.324023 0.322295
C  -1.995092 2.418332 0.683383
C  -3.933983 1.209074 1.378776
C  -3.047199 2.256005 1.577015
C  -1.380364 4.646028 1.270543
C  -2.548093 5.285218 0.871425
C  -0.46191 5.292666 2.086214
C  -2.79148 6.580482 1.306417
C  -0.712928 6.592309 2.501562
C  -1.880199 7.239909 2.120615
H  1.279748 -3.03163 0.261699
H  1.174003 -1.408753 -2.375087
H  3.369859 -0.621399 -1.919547
H  2.872273 0.779646 -0.985047
H  3.975163 -0.397211 -0.277856
H  2.311879 -0.396035 1.664373
H  1.070218 0.551601 0.850922
H  0.69908 -1.059591 1.468475
H  3.286767 -2.826153 -2.111813
H  -2.883509 0.013101 -2.647933
H  -3.12412 -1.361417 -1.574749
H  -0.998976 1.707928 -1.06563
H  -4.4555 -0.501935 0.19349
H  -4.753903 1.071699 2.071111
H  -3.174442 2.92386 2.419125
H  -3.261547 4.790396 0.224944
H  0.44535 4.783743 2.386101
H  -3.701259 7.077689 0.996774
H  0.007169 7.095317 3.133445
H  -2.076444 8.250901 2.451286
elementType: Cl O C H
totalener: -1958.43612238 hartree
nucrepener: 2446.25019579 hartree
electener: -4404.68631817 hartree
oneelecener: -7546.54460097 hartree
twoeener: 3141.85828280 hartree
cpcmener: -0.03164399 hartree
kineticenergy: 1952.55486281 hartree
xcener: -143.506958056498 hartree
chargesum: 0.0000000
charge: -0.058725 -0.063275 -0.290390 -0.478150 -0.342960 0.096650 0.024579 -0.062101 -0.271229 -0.271981 -0.203479 0.388411 0.040220 0.107550 0.064914 -0.339589 -0.228451 0.330095 -0.121598 -0.223116 0.290232 -0.198681 -0.255875 -0.152433 -0.127423 -0.187742 0.074204 0.101503 0.093865 0.098685 0.101634 0.104454 0.095158 0.095635 0.131908 0.124258 0.117762 0.133245 0.145421 0.162639 0.160588 0.159020 0.148748 0.162908 0.161321 0.161592
qa: -0.0587 -0.0633 -0.2904 -0.4781 -0.3430 0.0966 0.0246 -0.0621 -0.2712 -0.2720 -0.2035 0.3884 0.0402 0.1076 0.0649 -0.3396 -0.2285 0.3301 -0.1216 -0.2231 0.2902 -0.1987 -0.2559 -0.1524 -0.1274 -0.1877 0.0742 0.1015 0.0939 0.0987 0.1016 0.1045 0.0952 0.0956 0.1319 0.1243 0.1178 0.1332 0.1454 0.1626 0.1606 0.1590 0.1487 0.1629 0.1613 0.1616
va: 1.2670 1.2415 2.1164 2.0230 2.0389 3.7296 3.8915 3.7988 3.9060 3.8996 3.8969 4.2092 4.2049 3.7783 3.5845 4.0370 3.9786 3.6417 3.8862 3.9471 3.6841 3.9031 4.0033 3.8914 3.8840 3.8971 1.0513 1.0314 1.0052 1.0011 1.0005 1.0016 1.0022 1.0166 1.0183 0.9931 1.0091 1.0295 1.0026 0.9888 0.9946 0.9971 1.0074 0.9893 0.9884 0.9893
dispcorr: -0.022668622 hartree
energy: -1958.458791001175
dipole: -16.90165 16.40783 -0.49382 40.52841 -38.59812 1.93029 6.80710 -7.50234 -0.69523
magnitude: 2.11027 au
magnitude: 5.36388 debye
