program: Orca
programVersion: 5.0.3
elementType: Cl Cl O O O C C C C C C C C C C C C C C C C C C C C C H H H H H H H H H H H H H H H H H H H H
charge: 0
multiplicity: 1
keywords: wb97x-d3
keywords: def2-TZVPP
keywords: def2/J RIJCOSX
keywords: DEFGRID2
keywords: scfconv7
keywords: smallprint printgap noloewdin
keywords: NOSOSCF
formula: C21H20Cl2O3
InChI: InChI=1/C21H20Cl2O3/c1-21(2)17(12-18(22)23)19(21)20(24)25-13-14-7-6-10-16(11-14)26-15-8-4-3-5-9-15/h3-12,17,19H,13H2,1-2H3
46 atoms
Cl -0.075083 -1.391846 2.165765
Cl 1.310339 -3.254356 3.891415
O  -1.279792 -1.83903 -1.665092
O  0.404889 -0.375479 -1.809393
O  -1.816408 3.618584 0.081168
C  2.231376 -2.877301 -1.262926
C  1.924429 -2.180348 0.013916
C  0.784933 -2.564236 -0.915285
C  2.586867 -4.343685 -1.221656
C  2.955891 -2.12016 -2.347732
C  2.02063 -2.834056 1.336325
C  -0.005344 -1.47565 -1.515308
C  1.199567 -2.534727 2.333517
C  -2.233113 -0.818442 -2.000238
C  -2.423218 0.117771 -0.840824
C  -2.064458 1.453097 -0.957675
C  -2.906104 -0.365735 0.372523
C  -2.154302 2.291155 0.146105
C  -3.015273 0.485979 1.46059
C  -2.62844 1.815327 1.359091
C  -0.737145 4.017118 -0.668332
C  0.438305 3.277359 -0.738955
C  -0.846675 5.237346 -1.320182
C  1.501406 3.768591 -1.483447
C  0.229821 5.7211 -2.050124
C  1.404668 4.987484 -2.142228
H  2.143602 -1.115565 0.023896
H  0.19948 -3.423365 -0.608969
H  2.392225 -4.809099 -2.189165
H  3.647759 -4.472439 -0.999311
H  2.017958 -4.893616 -0.471556
H  2.660006 -2.476584 -3.33557
H  2.788211 -1.046949 -2.309588
H  4.029911 -2.28533 -2.24747
H  2.798363 -3.568449 1.513526
H  -1.933241 -0.28559 -2.903678
H  -3.148302 -1.365724 -2.220191
H  -1.696935 1.825354 -1.906071
H  -3.192952 -1.405331 0.469799
H  -3.390934 0.112559 2.404012
H  -2.694451 2.476895 2.213402
H  0.533531 2.329597 -0.224005
H  -1.766266 5.804792 -1.251898
H  2.414679 3.190892 -1.541901
H  0.142077 6.674003 -2.555468
H  2.238945 5.363029 -2.719471
elementType: Cl O C H
totalener: -1958.43300543 hartree
nucrepener: 2617.80279242 hartree
electener: -4576.23579785 hartree
oneelecener: -7890.40979884 hartree
twoeener: 3314.17400099 hartree
cpcmener: -0.02897162 hartree
kineticenergy: 1952.56738596 hartree
xcener: -143.508088528629 hartree
chargesum: -0.0000000
charge: -0.054027 -0.058814 -0.287044 -0.496091 -0.342123 0.143709 -0.053267 -0.102604 -0.282295 -0.275586 -0.212376 0.399141 0.077819 0.097300 0.057838 -0.210448 -0.300982 0.294278 -0.119594 -0.241713 0.304009 -0.197328 -0.257706 -0.146850 -0.122509 -0.192766 0.117858 0.107704 0.099327 0.102701 0.093654 0.101152 0.092563 0.096387 0.142665 0.115981 0.128625 0.144223 0.144666 0.162525 0.149672 0.147412 0.147572 0.162377 0.161005 0.161958
qa: -0.0540 -0.0588 -0.2870 -0.4961 -0.3421 0.1437 -0.0533 -0.1026 -0.2823 -0.2756 -0.2124 0.3991 0.0778 0.0973 0.0578 -0.2104 -0.3010 0.2943 -0.1196 -0.2417 0.3040 -0.1973 -0.2577 -0.1469 -0.1225 -0.1928 0.1179 0.1077 0.0993 0.1027 0.0937 0.1012 0.0926 0.0964 0.1427 0.1160 0.1286 0.1442 0.1447 0.1625 0.1497 0.1474 0.1476 0.1624 0.1610 0.1620
va: 1.2951 1.2486 2.1145 1.9962 2.0665 3.7181 3.8888 3.8183 3.9131 3.8857 3.9047 4.1393 4.1837 3.7948 3.5337 3.9162 3.9251 3.6954 3.8073 4.0085 3.6638 3.8915 4.0070 3.8876 3.8768 3.9032 1.0190 1.0268 1.0025 0.9991 0.9992 0.9988 1.0192 1.0009 1.0068 1.0089 0.9931 1.0103 1.0116 0.9877 1.0039 1.0111 1.0080 0.9896 0.9879 0.9892
dispcorr: -0.025579165 hartree
energy: -1958.458584595694
dipole: 8.26229 -7.75845 0.50385 3.62343 -5.08707 -1.46364 -27.33727 26.59610 -0.74117
magnitude: 1.71623 au
magnitude: 4.36231 debye
