program: Orca
programVersion: 5.0.3
elementType: Cl Cl O O O C C C C C C C C C C C C C C C C C C C C C H H H H H H H H H H H H H H H H H H H H
charge: 0
multiplicity: 1
keywords: wb97x-d3
keywords: def2-TZVPP
keywords: def2/J RIJCOSX
keywords: DEFGRID2
keywords: scfconv7
keywords: smallprint printgap noloewdin
keywords: NOSOSCF
formula: C21H20Cl2O3
InChI: InChI=1/C21H20Cl2O3/c1-21(2)17(12-18(22)23)19(21)20(24)25-13-14-7-6-10-16(11-14)26-15-8-4-3-5-9-15/h3-12,17,19H,13H2,1-2H3
46 atoms
Cl 3.277379 -0.402362 1.978221
Cl 3.306518 -2.850558 3.502888
O  -1.789197 -2.057634 -1.227293
O  -0.273721 -0.472727 -1.668424
O  -2.691748 3.437096 0.134972
C  1.739835 -2.863168 -1.473688
C  1.728574 -2.102384 -0.180781
C  0.419962 -2.586788 -0.784756
C  2.179929 -4.307313 -1.491895
C  2.136557 -2.115866 -2.72303
C  2.17457 -2.698712 1.082589
C  -0.54572 -1.584211 -1.275468
C  2.829233 -2.063487 2.04639
C  -2.865342 -1.170354 -1.576165
C  -3.095323 -0.156629 -0.492267
C  -2.81283 1.183223 -0.718753
C  -3.557258 -0.564533 0.756645
C  -2.956537 2.102735 0.312143
C  -3.724635 0.366782 1.769199
C  -3.41319 1.703183 1.558438
C  -1.593766 3.825356 -0.592191
C  -1.715333 4.996947 -1.326731
C  -0.392187 3.125702 -0.56778
C  -0.626134 5.469497 -2.044928
C  0.684078 3.604396 -1.301771
C  0.575087 4.773422 -2.043352
H  1.903594 -1.037702 -0.285744
H  -0.032203 -3.449344 -0.309046
H  3.269148 -4.373629 -1.492322
H  1.808647 -4.880333 -0.6435
H  1.81753 -4.79613 -2.397325
H  3.2042 -2.253928 -2.900538
H  1.605768 -2.506154 -3.593068
H  1.952392 -1.046488 -2.663887
H  1.946523 -3.743302 1.25779
H  -2.674913 -0.693232 -2.538145
H  -3.727625 -1.825066 -1.688511
H  -2.465963 1.499899 -1.694675
H  -3.788327 -1.607237 0.936662
H  -4.088962 0.052522 2.738257
H  -3.525365 2.429273 2.353514
H  -2.65523 5.534514 -1.332823
H  -0.285537 2.218158 0.012658
H  -0.724695 6.383641 -2.615653
H  1.617167 3.056237 -1.285365
H  1.419435 5.139556 -2.611921
elementType: Cl O C H
totalener: -1958.43568499 hartree
nucrepener: 2532.68639430 hartree
electener: -4491.12207929 hartree
oneelecener: -7719.82111830 hartree
twoeener: 3228.69903902 hartree
cpcmener: -0.03008297 hartree
kineticenergy: 1952.55651670 hartree
xcener: -143.505886250278 hartree
chargesum: -0.0000000
charge: -0.058778 -0.062799 -0.289658 -0.499652 -0.343028 0.089680 0.021533 -0.074324 -0.269929 -0.271128 -0.199727 0.430764 0.040549 0.092417 0.004209 -0.188272 -0.245016 0.279638 -0.114999 -0.250615 0.305726 -0.259358 -0.204751 -0.121756 -0.142952 -0.195439 0.082464 0.095683 0.100912 0.093885 0.098813 0.097244 0.101361 0.093763 0.131363 0.117693 0.130815 0.143419 0.145408 0.160994 0.149315 0.147787 0.152549 0.161286 0.161304 0.161606
qa: -0.0588 -0.0628 -0.2897 -0.4997 -0.3430 0.0897 0.0215 -0.0743 -0.2699 -0.2711 -0.1997 0.4308 0.0405 0.0924 0.0042 -0.1883 -0.2450 0.2796 -0.1150 -0.2506 0.3057 -0.2594 -0.2048 -0.1218 -0.1430 -0.1954 0.0825 0.0957 0.1009 0.0939 0.0988 0.0972 0.1014 0.0938 0.1314 0.1177 0.1308 0.1434 0.1454 0.1610 0.1493 0.1478 0.1525 0.1613 0.1613 0.1616
va: 1.2664 1.2424 2.1280 1.9981 2.0655 3.7277 3.8805 3.8323 3.9111 3.9010 3.8976 4.1285 4.2072 3.7942 3.6011 3.8974 3.9708 3.7082 3.8774 4.0218 3.6714 4.0057 3.8868 3.8764 3.8839 3.9054 1.0385 1.0335 1.0006 1.0052 1.0009 0.9999 0.9988 1.0196 1.0184 1.0087 0.9923 1.0134 1.0058 0.9875 1.0049 1.0080 1.0056 0.9877 0.9901 0.9892
dispcorr: -0.022771023 hartree
energy: -1958.458456011486
dipole: -12.11136 11.66917 -0.44219 -1.17875 -0.61678 -1.79553 -26.71546 25.87274 -0.84272
magnitude: 2.03215 au
magnitude: 5.16531 debye
