program: Orca
programVersion: 5.0.3
elementType: Cl Cl O O O C C C C C C C C C C C C C C C C C C C C C H H H H H H H H H H H H H H H H H H H H
charge: 0
multiplicity: 1
keywords: wb97x-d3
keywords: def2-TZVPP
keywords: def2/J RIJCOSX
keywords: DEFGRID2
keywords: scfconv7
keywords: smallprint printgap noloewdin
keywords: NOSOSCF
formula: C21H20Cl2O3
InChI: InChI=1/C21H20Cl2O3/c1-21(2)17(12-18(22)23)19(21)20(24)25-13-14-7-6-10-16(11-14)26-15-8-4-3-5-9-15/h3-12,17,19H,13H2,1-2H3
46 atoms
Cl 3.670365 -0.187504 -1.959011
Cl 4.753406 0.568558 0.60606
O  -1.979161 -2.094971 1.007512
O  -1.413812 -1.771201 -1.134091
O  -2.545209 2.907166 0.685702
C  1.241311 -3.130232 -0.023132
C  1.463203 -1.667037 -0.29434
C  0.279037 -2.101404 0.536037
C  2.103601 -3.842428 0.989153
C  0.842938 -4.003117 -1.186546
C  2.545367 -0.928811 0.373222
C  -1.095177 -1.964664 0.015423
C  3.520689 -0.278736 -0.246841
C  -3.363003 -1.947988 0.703173
C  -3.740813 -0.537771 0.34162
C  -2.952449 0.538633 0.72265
C  -4.918184 -0.311691 -0.365219
C  -3.316979 1.824093 0.346962
C  -5.296081 0.982024 -0.688901
C  -4.490804 2.060638 -0.349942
C  -1.181642 2.830166 0.542274
C  -0.577838 2.127864 -0.495625
C  -0.415208 3.53696 1.458105
C  0.805251 2.137194 -0.602299
C  0.967029 3.542166 1.333103
C  1.584568 2.839978 0.30729
H  1.234382 -1.356078 -1.308034
H  0.363625 -1.942204 1.605434
H  1.603066 -4.748887 1.333499
H  3.054559 -4.137658 0.542754
H  2.318784 -3.234294 1.866869
H  1.736485 -4.439013 -1.635934
H  0.20695 -4.825737 -0.854916
H  0.317042 -3.461213 -1.96921
H  2.558326 -0.917193 1.456709
H  -3.66059 -2.638648 -0.08856
H  -3.877664 -2.255518 1.613608
H  -2.044992 0.387838 1.294355
H  -5.536272 -1.148508 -0.666608
H  -6.214254 1.153867 -1.235011
H  -4.766474 3.069765 -0.627748
H  -1.168696 1.578566 -1.21749
H  -0.898937 4.080431 2.259942
H  1.272723 1.595447 -1.414091
H  1.561368 4.094685 2.049017
H  2.66246 2.84157 0.215894
elementType: Cl O C H
totalener: -1958.43652954 hartree
nucrepener: 2636.85609007 hartree
electener: -4595.29261962 hartree
oneelecener: -7927.68345960 hartree
twoeener: 3332.39083998 hartree
cpcmener: -0.03048065 hartree
kineticenergy: 1952.56273491 hartree
xcener: -143.511627551666 hartree
chargesum: 0.0000000
charge: -0.060594 -0.060786 -0.292910 -0.479266 -0.343474 0.105174 -0.008796 -0.056973 -0.259900 -0.270917 -0.175770 0.388009 0.019312 0.095675 0.031629 -0.227272 -0.236304 0.276360 -0.116209 -0.254137 0.309537 -0.204851 -0.257428 -0.159357 -0.122598 -0.178189 0.089273 0.099304 0.099910 0.100992 0.091222 0.098326 0.103898 0.091624 0.139845 0.120584 0.127920 0.148865 0.146016 0.161208 0.148164 0.151299 0.147006 0.160042 0.160033 0.154503
qa: -0.0606 -0.0608 -0.2929 -0.4793 -0.3435 0.1052 -0.0088 -0.0570 -0.2599 -0.2709 -0.1758 0.3880 0.0193 0.0957 0.0316 -0.2273 -0.2363 0.2764 -0.1162 -0.2541 0.3095 -0.2049 -0.2574 -0.1594 -0.1226 -0.1782 0.0893 0.0993 0.0999 0.1010 0.0912 0.0983 0.1039 0.0916 0.1398 0.1206 0.1279 0.1489 0.1460 0.1612 0.1482 0.1513 0.1470 0.1600 0.1600 0.1545
va: 1.2615 1.2443 2.1194 2.0138 2.0665 3.7781 3.8502 3.8221 3.9054 3.9038 3.8182 4.1535 4.1766 3.7900 3.6025 3.9209 3.9748 3.7111 3.8798 4.0207 3.6585 3.9024 4.0158 3.8522 3.9150 3.8609 1.0369 1.0350 1.0020 1.0014 1.0038 1.0007 0.9992 1.0182 1.0126 1.0079 0.9914 1.0135 1.0004 0.9873 1.0051 1.0064 1.0078 0.9967 0.9882 1.0046
dispcorr: -0.027100308 hartree
energy: -1958.463629852585
dipole: -20.18829 19.82213 -0.36616 -15.91208 14.31998 -1.59210 4.62897 -3.43902 1.18995
magnitude: 2.02109 au
magnitude: 5.13721 debye
