program: Orca
programVersion: 5.0.3
elementType: Cl Cl O O O C C C C C C C C C C C C C C C C C C C C C H H H H H H H H H H H H H H H H H H H H
charge: 0
multiplicity: 1
keywords: wb97x-d3
keywords: def2-TZVPP
keywords: def2/J RIJCOSX
keywords: DEFGRID2
keywords: scfconv7
keywords: smallprint printgap noloewdin
keywords: NOSOSCF
formula: C21H20Cl2O3
InChI: InChI=1/C21H20Cl2O3/c1-21(2)17(12-18(22)23)19(21)20(24)25-13-14-7-6-10-16(11-14)26-15-8-4-3-5-9-15/h3-12,17,19H,13H2,1-2H3
46 atoms
Cl 4.854345 -1.5178 -0.369275
Cl 5.236782 -4.353783 -0.014805
O  -1.437109 -1.810764 1.166539
O  0.031372 -0.211604 0.63049
O  -3.468168 3.610948 0.026458
C  0.65858 -2.434053 -1.567428
C  1.798675 -2.241183 -0.60476
C  0.401279 -2.471916 -0.074728
C  0.504823 -3.741639 -2.303573
C  0.223642 -1.241729 -2.38397
C  2.81195 -3.281223 -0.38988
C  -0.316561 -1.369118 0.597076
C  4.117285 -3.070892 -0.277864
C  -2.302151 -0.839864 1.769404
C  -2.94527 0.046701 0.740442
C  -2.873717 1.425995 0.877071
C  -3.617562 -0.50969 -0.344537
C  -3.464604 2.244938 -0.07728
C  -4.208307 0.318058 -1.286092
C  -4.130178 1.697833 -1.163866
C  -2.376037 4.286513 0.508366
C  -1.069149 3.89042 0.248806
C  -2.634586 5.445439 1.227803
C  -0.021547 4.66543 0.72707
C  -1.576729 6.214905 1.689148
C  -0.266095 5.827298 1.446455
H  2.15281 -1.219832 -0.528859
H  0.186325 -3.457459 0.323444
H  0.727887 -4.610017 -1.685294
H  -0.519947 -3.850431 -2.661349
H  1.16317 -3.769587 -3.173349
H  0.730783 -1.255991 -3.349954
H  -0.85072 -1.275954 -2.575113
H  0.452665 -0.288909 -1.911585
H  2.475331 -4.307791 -0.307907
H  -3.050765 -1.43372 2.292127
H  -1.761336 -0.253125 2.513833
H  -2.35309 1.852638 1.725981
H  -3.685461 -1.584738 -0.45337
H  -4.731914 -0.111155 -2.129891
H  -4.585131 2.345563 -1.902441
H  -0.85878 2.991299 -0.316483
H  -3.657751 5.743624 1.41833
H  0.995684 4.355635 0.527124
H  -1.782745 7.118706 2.247085
H  0.557306 6.425837 1.812138
elementType: Cl O C H
totalener: -1958.43593987 hartree
nucrepener: 2474.27838202 hartree
electener: -4432.71432189 hartree
oneelecener: -7602.70643141 hartree
twoeener: 3169.99210953 hartree
cpcmener: -0.03065869 hartree
kineticenergy: 1952.55920731 hartree
xcener: -143.507116150367 hartree
chargesum: -0.0000000
charge: -0.058578 -0.062728 -0.285700 -0.484913 -0.339341 0.094481 0.027562 -0.078246 -0.268048 -0.266028 -0.205939 0.404769 0.038968 0.095178 0.041721 -0.226092 -0.279511 0.305360 -0.100742 -0.262446 0.312396 -0.207414 -0.265456 -0.146257 -0.118949 -0.196399 0.075373 0.101850 0.092634 0.099184 0.100973 0.101992 0.097124 0.092429 0.134329 0.127957 0.118276 0.147089 0.142478 0.160973 0.149443 0.158114 0.147100 0.161963 0.161446 0.161623
qa: -0.0586 -0.0627 -0.2857 -0.4849 -0.3393 0.0945 0.0276 -0.0782 -0.2680 -0.2660 -0.2059 0.4048 0.0390 0.0952 0.0417 -0.2261 -0.2795 0.3054 -0.1007 -0.2624 0.3124 -0.2074 -0.2655 -0.1463 -0.1189 -0.1964 0.0754 0.1018 0.0926 0.0992 0.1010 0.1020 0.0971 0.0924 0.1343 0.1280 0.1183 0.1471 0.1425 0.1610 0.1494 0.1581 0.1471 0.1620 0.1614 0.1616
va: 1.2671 1.2423 2.1211 2.0161 2.0686 3.7305 3.8759 3.8134 3.9040 3.9069 3.8947 4.1940 4.2055 3.7884 3.5925 3.9321 3.9500 3.6846 3.8682 4.0218 3.6642 3.9023 4.0091 3.8879 3.8744 3.9058 1.0508 1.0316 1.0049 1.0009 1.0010 1.0016 1.0010 1.0148 1.0164 0.9923 1.0092 1.0065 1.0113 0.9875 1.0058 0.9990 1.0086 0.9896 0.9877 0.9893
dispcorr: -0.022812130 hartree
energy: -1958.458752000008
dipole: -31.10442 29.92230 -1.18211 11.14073 -12.42054 -1.27981 -7.07531 6.87779 -0.19751
magnitude: 1.75337 au
magnitude: 4.45672 debye
