program: Orca
programVersion: 5.0.3
elementType: Cl Cl O O O C C C C C C C C C C C C C C C C C C C C C H H H H H H H H H H H H H H H H H H H H
charge: 0
multiplicity: 1
keywords: wb97x-d3
keywords: def2-TZVPP
keywords: def2/J RIJCOSX
keywords: DEFGRID2
keywords: scfconv7
keywords: smallprint printgap noloewdin
keywords: NOSOSCF
formula: C21H20Cl2O3
InChI: InChI=1/C21H20Cl2O3/c1-21(2)17(12-18(22)23)19(21)20(24)25-13-14-7-6-10-16(11-14)26-15-8-4-3-5-9-15/h3-12,17,19H,13H2,1-2H3
46 atoms
Cl 3.377617 -3.739807 1.676335
Cl 4.765353 -4.653246 -0.680457
O  -1.720092 -1.563378 -1.613905
O  -1.083738 -1.76631 0.519997
O  -2.196264 3.350184 -0.607329
C  1.53008 -0.5683 -0.90882
C  1.743819 -1.938782 -0.325084
C  0.55688 -1.686732 -1.224555
C  2.389326 -0.0907 -2.053589
C  1.138586 0.540999 0.036796
C  2.806762 -2.831327 -0.8002
C  -0.80368 -1.687959 -0.653302
C  3.54276 -3.626505 -0.034055
C  -3.08119 -1.407025 -1.208742
C  -3.321715 -0.106468 -0.494223
C  -2.629829 1.045943 -0.85694
C  -4.256851 -0.048184 0.531045
C  -2.876644 2.232637 -0.187933
C  -4.506455 1.152627 1.181948
C  -3.817083 2.302663 0.832256
C  -1.545267 4.120727 0.321868
C  -1.493968 5.486818 0.080892
C  -0.916678 3.571075 1.433213
C  -0.806749 6.309698 0.961637
C  -0.239501 4.408911 2.308906
C  -0.181773 5.777401 2.081484
H  1.505347 -2.016373 0.729531
H  0.620954 -2.065228 -2.238853
H  2.605131 -0.870223 -2.782973
H  1.887313 0.720613 -2.583448
H  3.340006 0.295809 -1.682092
H  0.570292 0.194075 0.897687
H  2.036456 1.032649 0.415648
H  0.545054 1.297706 -0.48068
H  3.007613 -2.859636 -1.864559
H  -3.64843 -1.444386 -2.139184
H  -3.40164 -2.250975 -0.593971
H  -1.891617 1.032674 -1.650059
H  -4.788624 -0.943902 0.827425
H  -5.239468 1.192344 1.976869
H  -4.010682 3.236113 1.345454
H  -1.984831 5.900682 -0.790941
H  -0.945334 2.504948 1.620828
H  -0.767223 7.374235 0.771121
H  0.247431 3.982097 3.17608
H  0.346236 6.422906 2.77051
elementType: Cl O C H
totalener: -1958.43625789 hartree
nucrepener: 2505.11753878 hartree
electener: -4463.55379667 hartree
oneelecener: -7664.14200842 hartree
twoeener: 3200.58821174 hartree
cpcmener: -0.03168772 hartree
kineticenergy: 1952.55502360 hartree
xcener: -143.507033735712 hartree
chargesum: -0.0000000
charge: -0.058955 -0.062707 -0.289432 -0.476368 -0.346520 0.112393 0.021140 -0.070554 -0.269550 -0.281454 -0.204986 0.392733 0.038710 0.096463 0.036754 -0.292098 -0.209576 0.257513 -0.135137 -0.177671 0.295117 -0.245308 -0.185220 -0.133547 -0.176921 -0.180164 0.075288 0.102906 0.093038 0.098595 0.101314 0.098584 0.108250 0.089649 0.133695 0.124996 0.120630 0.140681 0.145498 0.162275 0.160757 0.148043 0.158447 0.160657 0.160993 0.161047
qa: -0.0590 -0.0627 -0.2894 -0.4764 -0.3465 0.1124 0.0211 -0.0706 -0.2696 -0.2815 -0.2050 0.3927 0.0387 0.0965 0.0368 -0.2921 -0.2096 0.2575 -0.1351 -0.1777 0.2951 -0.2453 -0.1852 -0.1335 -0.1769 -0.1802 0.0753 0.1029 0.0930 0.0986 0.1013 0.0986 0.1082 0.0896 0.1337 0.1250 0.1206 0.1407 0.1455 0.1623 0.1608 0.1480 0.1584 0.1607 0.1610 0.1610
va: 1.2666 1.2424 2.1172 2.0233 2.0355 3.7403 3.8972 3.8086 3.9013 3.8946 3.8981 4.2026 4.2059 3.7847 3.6114 4.0143 3.9665 3.7330 3.8913 3.9242 3.6433 4.0029 3.8616 3.8918 3.9247 3.8899 1.0515 1.0313 1.0053 1.0019 1.0009 1.0139 1.0027 1.0026 1.0169 0.9928 1.0076 1.0219 1.0016 0.9889 0.9942 1.0075 0.9944 0.9881 0.9907 0.9889
dispcorr: -0.024259474 hartree
energy: -1958.460517368397
dipole: -20.23949 19.66164 -0.57785 32.53711 -31.65606 0.88105 -4.24165 3.23812 -1.00353
magnitude: 1.45506 au
magnitude: 3.69848 debye
