program: Orca
programVersion: 5.0.3
elementType: Cl Cl O O O C C C C C C C C C C C C C C C C C C C C C H H H H H H H H H H H H H H H H H H H H
charge: 0
multiplicity: 1
keywords: wb97x-d3
keywords: def2-TZVPP
keywords: def2/J RIJCOSX
keywords: DEFGRID2
keywords: scfconv7
keywords: smallprint printgap noloewdin
keywords: NOSOSCF
formula: C21H20Cl2O3
InChI: InChI=1/C21H20Cl2O3/c1-21(2)17(12-18(22)23)19(21)20(24)25-13-14-7-6-10-16(11-14)26-15-8-4-3-5-9-15/h3-12,17,19H,13H2,1-2H3
46 atoms
Cl 4.812412 -1.501344 0.494843
Cl 5.142458 -4.304929 -0.101742
O  -1.579968 -1.974376 0.73219
O  -0.130774 -0.273337 0.86635
O  -3.448698 3.416822 0.160168
C  0.93028 -1.721948 -1.744745
C  1.879665 -1.907408 -0.593408
C  0.410651 -2.224816 -0.413027
C  0.910266 -2.715584 -2.879653
C  0.645665 -0.30993 -2.194835
C  2.840012 -3.016343 -0.553637
C  -0.425663 -1.372709 0.456311
C  4.089142 -2.940871 -0.112809
C  -2.568513 -1.246253 1.47927
C  -3.240194 -0.221348 0.611203
C  -3.02226 1.132628 0.827682
C  -4.06137 -0.632629 -0.43582
C  -3.600971 2.067194 -0.021925
C  -4.648021 0.309746 -1.26528
C  -4.412269 1.663433 -1.071392
C  -2.243587 3.946836 0.543656
C  -2.298091 5.111262 1.298819
C  -1.02046 3.408133 0.160982
C  -1.120183 5.739393 1.674714
C  0.149867 4.042021 0.556288
C  0.109334 5.20629 1.311218
H  2.207815 -0.983806 -0.130512
H  0.142548 -3.275322 -0.400852
H  -0.040511 -2.653185 -3.411291
H  1.704424 -2.496036 -3.595219
H  1.030775 -3.746166 -2.548923
H  0.77535 0.42964 -1.407686
H  1.3255 -0.043274 -3.005561
H  -0.372941 -0.223993 -2.577674
H  2.507032 -3.985883 -0.904482
H  -3.275889 -2.007709 1.802376
H  -2.126234 -0.795172 2.368189
H  -2.397133 1.449846 1.653267
H  -4.244902 -1.687436 -0.598796
H  -5.289219 -0.007149 -2.077019
H  -4.859086 2.402219 -1.724491
H  -3.258151 5.523117 1.583532
H  -0.967076 2.508728 -0.43932
H  -1.168078 6.647765 2.26092
H  1.101578 3.618857 0.26237
H  1.026794 5.69411 1.611889
elementType: Cl O C H
totalener: -1958.43603376 hartree
nucrepener: 2499.36415833 hartree
electener: -4457.80019209 hartree
oneelecener: -7652.84223938 hartree
twoeener: 3195.04204729 hartree
cpcmener: -0.03003153 hartree
kineticenergy: 1952.55501878 hartree
xcener: -143.505777904898 hartree
chargesum: 0.0000000
charge: -0.058569 -0.063041 -0.284374 -0.492704 -0.338896 0.095123 0.026872 -0.086333 -0.267428 -0.263635 -0.202564 0.423211 0.038228 0.085555 -0.001418 -0.198804 -0.241549 0.295863 -0.113916 -0.256340 0.318215 -0.261238 -0.214564 -0.121871 -0.153433 -0.190971 0.077592 0.099979 0.098400 0.100524 0.092860 0.084346 0.101351 0.100871 0.132436 0.129777 0.117782 0.146069 0.145416 0.161840 0.149034 0.146997 0.159574 0.160859 0.161601 0.161274
qa: -0.0586 -0.0630 -0.2844 -0.4927 -0.3389 0.0951 0.0269 -0.0863 -0.2674 -0.2636 -0.2026 0.4232 0.0382 0.0856 -0.0014 -0.1988 -0.2415 0.2959 -0.1139 -0.2563 0.3182 -0.2612 -0.2146 -0.1219 -0.1534 -0.1910 0.0776 0.1000 0.0984 0.1005 0.0929 0.0843 0.1014 0.1009 0.1324 0.1298 0.1178 0.1461 0.1454 0.1618 0.1490 0.1470 0.1596 0.1609 0.1616 0.1613
va: 1.2670 1.2418 2.1266 2.0101 2.0737 3.7292 3.8752 3.8245 3.9061 3.9133 3.8961 4.1704 4.2078 3.8018 3.6082 3.9035 3.9700 3.6979 3.8784 4.0210 3.6764 3.9979 3.8962 3.8789 3.8919 3.9047 1.0483 1.0330 1.0010 1.0011 1.0054 1.0148 1.0018 0.9991 1.0176 0.9932 1.0084 1.0128 1.0055 0.9874 1.0058 1.0087 0.9915 0.9879 0.9898 0.9893
dispcorr: -0.023273322 hartree
energy: -1958.459307082534
dipole: -28.84125 27.73555 -1.10570 14.14696 -15.26261 -1.11565 -11.17760 10.32386 -0.85374
magnitude: 1.78777 au
magnitude: 4.54415 debye
