program: Orca
programVersion: 5.0.3
elementType: Cl Cl O O O C C C C C C C C C C C C C C C C C C C C C H H H H H H H H H H H H H H H H H H H H
charge: 0
multiplicity: 1
keywords: wb97x-d3
keywords: def2-TZVPP
keywords: def2/J RIJCOSX
keywords: DEFGRID2
keywords: scfconv7
keywords: smallprint printgap noloewdin
keywords: NOSOSCF
formula: C21H20Cl2O3
InChI: InChI=1/C21H20Cl2O3/c1-21(2)17(12-18(22)23)19(21)20(24)25-13-14-7-6-10-16(11-14)26-15-8-4-3-5-9-15/h3-12,17,19H,13H2,1-2H3
46 atoms
Cl 2.813995 -4.882395 -0.467819
Cl 4.988041 -3.717346 -1.963328
O  -1.045778 -0.069886 -1.853672
O  -1.267933 -1.674174 -0.314235
O  -3.066842 3.586427 1.169847
C  1.578356 -0.700007 0.55301
C  1.723313 -1.926931 -0.299992
C  0.893135 -0.755779 -0.796351
C  2.719017 0.282718 0.666022
C  0.787354 -0.828419 1.832331
C  2.973236 -2.241398 -1.000889
C  -0.567495 -0.90664 -0.932372
C  3.508876 -3.449296 -1.12125
C  -2.459251 -0.060669 -2.069591
C  -3.207227 0.588667 -0.93986
C  -2.743721 1.779194 -0.390043
C  -4.390471 0.027987 -0.474053
C  -3.462567 2.388458 0.628504
C  -5.110877 0.660246 0.528856
C  -4.648165 1.839016 1.093467
C  -1.74983 3.772628 1.509166
C  -0.983897 2.764536 2.081819
C  -1.219615 5.03953 1.310221
C  0.327418 3.035756 2.446079
C  0.09036 5.298152 1.688437
C  0.871575 4.298452 2.251886
H  1.145456 -2.778586 0.040671
H  1.353185 -0.140528 -1.560921
H  3.458578 -0.07118 1.385945
H  3.228106 0.460875 -0.28003
H  2.345849 1.24535 1.019884
H  0.105347 -1.674698 1.836044
H  1.475858 -0.96178 2.667909
H  0.20823 0.074777 2.02619
H  3.511216 -1.423301 -1.464854
H  -2.588888 0.510413 -2.988356
H  -2.829556 -1.070445 -2.253866
H  -1.83072 2.233332 -0.756133
H  -4.749859 -0.901784 -0.897005
H  -6.032419 0.222843 0.888814
H  -5.199747 2.328509 1.88562
H  -1.398193 1.778109 2.249114
H  -1.829294 5.816376 0.8667
H  0.924162 2.250255 2.89154
H  0.501125 6.287036 1.533094
H  1.894174 4.501275 2.540399
elementType: Cl O C H
totalener: -1958.43631980 hartree
nucrepener: 2525.68113734 hartree
electener: -4484.11745713 hartree
oneelecener: -7704.86874328 hartree
twoeener: 3220.75128615 hartree
cpcmener: -0.03169308 hartree
kineticenergy: 1952.56610665 hartree
xcener: -143.509335439407 hartree
chargesum: 0.0000000
charge: -0.057955 -0.062280 -0.293899 -0.488734 -0.344806 0.109671 0.019029 -0.065942 -0.271539 -0.276981 -0.202228 0.409167 0.037381 0.108124 0.024934 -0.219277 -0.220154 0.256346 -0.118885 -0.246055 0.280093 -0.174336 -0.253356 -0.172677 -0.122085 -0.191536 0.080970 0.097363 0.101326 0.093464 0.095596 0.099414 0.104588 0.084301 0.132514 0.124319 0.118028 0.142638 0.145691 0.160955 0.149436 0.163448 0.148289 0.173832 0.161373 0.160433
qa: -0.0580 -0.0623 -0.2939 -0.4887 -0.3448 0.1097 0.0190 -0.0659 -0.2715 -0.2770 -0.2022 0.4092 0.0374 0.1081 0.0249 -0.2193 -0.2202 0.2563 -0.1189 -0.2461 0.2801 -0.1743 -0.2534 -0.1727 -0.1221 -0.1915 0.0810 0.0974 0.1013 0.0935 0.0956 0.0994 0.1046 0.0843 0.1325 0.1243 0.1180 0.1426 0.1457 0.1610 0.1494 0.1634 0.1483 0.1738 0.1614 0.1604
va: 1.2677 1.2427 2.1195 2.0136 2.0563 3.6746 3.8949 3.8345 3.9168 3.9013 3.8991 4.1565 4.2077 3.7864 3.6203 3.9265 3.9562 3.7180 3.8869 4.0134 3.7039 3.8666 4.0055 3.8738 3.8867 3.9159 1.0468 1.0340 1.0004 1.0068 1.0034 1.0222 1.0002 1.0043 1.0175 0.9931 1.0097 1.0172 1.0025 0.9880 1.0049 0.9935 1.0072 0.9788 0.9872 0.9910
dispcorr: -0.024593807 hartree
energy: -1958.460913602686
dipole: -16.59888 16.98185 0.38297 29.32683 -28.01187 1.31496 13.64731 -13.96712 -0.31980
magnitude: 1.40644 au
magnitude: 3.57488 debye
