program: Orca
programVersion: 5.0.3
elementType: Cl Cl O O O C C C C C C C C C C C C C C C C C C C C C H H H H H H H H H H H H H H H H H H H H
charge: 0
multiplicity: 1
keywords: wb97x-d3
keywords: def2-TZVPP
keywords: def2/J RIJCOSX
keywords: DEFGRID2
keywords: scfconv7
keywords: smallprint printgap noloewdin
keywords: NOSOSCF
formula: C21H20Cl2O3
InChI: InChI=1/C21H20Cl2O3/c1-21(2)17(12-18(22)23)19(21)20(24)25-13-14-7-6-10-16(11-14)26-15-8-4-3-5-9-15/h3-12,17,19H,13H2,1-2H3
46 atoms
Cl 2.816126 -4.915846 -0.452375
Cl 5.008373 -3.765682 -1.933314
O  -0.998679 -0.019597 -1.866344
O  -1.258291 -1.680758 -0.393785
O  -3.05019 3.610656 1.194464
C  1.588631 -0.729589 0.538778
C  1.729135 -1.955089 -0.318217
C  0.91999 -0.772648 -0.819909
C  2.739847 0.237931 0.670737
C  0.781017 -0.853558 1.807744
C  2.985243 -2.279346 -1.004631
C  -0.541606 -0.899303 -0.975263
C  3.520081 -3.489122 -1.110116
C  -2.409677 0.018633 -2.099582
C  -3.160162 0.63957 -0.955791
C  -2.712631 1.832362 -0.397398
C  -4.325888 0.049597 -0.481934
C  -3.428893 2.413993 0.639016
C  -5.045518 0.655061 0.538269
C  -4.597816 1.835078 1.111845
C  -1.730015 3.828989 1.49955
C  -0.913219 2.829819 2.014979
C  -1.248154 5.118669 1.325521
C  0.400062 3.132797 2.344885
C  0.064755 5.408647 1.668748
C  0.896852 4.418219 2.172767
H  1.138852 -2.802405 0.012039
H  1.39773 -0.158632 -1.574715
H  3.464001 -0.126578 1.401257
H  3.265368 0.411397 -0.267329
H  2.373308 1.204483 1.02091
H  0.05924 -1.666054 1.783371
H  1.45508 -1.042218 2.644777
H  0.244316 0.072211 2.020931
H  3.530384 -1.465921 -1.468452
H  -2.518497 0.623046 -2.999723
H  -2.792543 -0.978795 -2.321899
H  -1.813843 2.308189 -0.771779
H  -4.672183 -0.88151 -0.912594
H  -5.954554 0.196206 0.903843
H  -5.148044 2.303459 1.917741
H  -1.289874 1.825553 2.164089
H  -1.897461 5.888668 0.928693
H  1.036843 2.353222 2.743123
H  0.43729 6.415623 1.534207
H  1.921703 4.645906 2.433185
elementType: Cl O C H
totalener: -1958.43637294 hartree
nucrepener: 2521.67052817 hartree
electener: -4480.10690111 hartree
oneelecener: -7696.82004192 hartree
twoeener: 3216.71314082 hartree
cpcmener: -0.03183276 hartree
kineticenergy: 1952.55606610 hartree
xcener: -143.507154582850 hartree
chargesum: 0.0000000
charge: -0.057964 -0.062274 -0.292509 -0.488493 -0.344193 0.104658 0.023074 -0.072130 -0.270344 -0.270481 -0.202530 0.410899 0.036440 0.106224 0.026183 -0.225404 -0.219917 0.262140 -0.118502 -0.247500 0.286430 -0.182296 -0.256713 -0.162296 -0.119453 -0.198448 0.080261 0.097719 0.101764 0.093348 0.095326 0.098054 0.104745 0.082836 0.132578 0.125034 0.118058 0.142515 0.146006 0.161098 0.149463 0.165127 0.148083 0.172038 0.161281 0.160067
qa: -0.0580 -0.0623 -0.2925 -0.4885 -0.3442 0.1047 0.0231 -0.0721 -0.2703 -0.2705 -0.2025 0.4109 0.0364 0.1062 0.0262 -0.2254 -0.2199 0.2621 -0.1185 -0.2475 0.2864 -0.1823 -0.2567 -0.1623 -0.1195 -0.1984 0.0803 0.0977 0.1018 0.0933 0.0953 0.0981 0.1047 0.0828 0.1326 0.1250 0.1181 0.1425 0.1460 0.1611 0.1495 0.1651 0.1481 0.1720 0.1613 0.1601
va: 1.2677 1.2427 2.1198 2.0149 2.0589 3.6885 3.8895 3.8350 3.9145 3.9007 3.8970 4.1617 4.2074 3.7874 3.6187 3.9297 3.9542 3.7133 3.8876 4.0135 3.7054 3.8735 4.0070 3.8738 3.8833 3.9277 1.0472 1.0341 1.0004 1.0069 1.0046 1.0219 1.0003 1.0050 1.0174 0.9932 1.0091 1.0165 1.0028 0.9880 1.0050 0.9918 1.0074 0.9800 0.9872 0.9913
dispcorr: -0.024470802 hartree
energy: -1958.460843738153
dipole: -16.50922 16.90864 0.39943 29.64140 -28.28135 1.36005 13.36545 -13.67672 -0.31127
magnitude: 1.45126 au
magnitude: 3.68881 debye
