program: Orca
programVersion: 5.0.3
elementType: Cl Cl O O O C C C C C C C C C C C C C C C C C C C C C H H H H H H H H H H H H H H H H H H H H
charge: 0
multiplicity: 1
keywords: wb97x-d3
keywords: def2-TZVPP
keywords: def2/J RIJCOSX
keywords: DEFGRID2
keywords: scfconv7
keywords: smallprint printgap noloewdin
keywords: NOSOSCF
formula: C21H20Cl2O3
InChI: InChI=1/C21H20Cl2O3/c1-21(2)17(12-18(22)23)19(21)20(24)25-13-14-7-6-10-16(11-14)26-15-8-4-3-5-9-15/h3-12,17,19H,13H2,1-2H3
46 atoms
Cl 3.252654 0.415915 1.339076
Cl 3.46419 -1.399547 3.56636
O  -1.929217 -2.264215 -0.824221
O  -0.483874 -0.854539 -1.791629
O  -2.495967 3.175866 -0.02818
C  1.595024 -3.067628 -1.016661
C  1.647265 -1.926224 -0.044705
C  0.316191 -2.591009 -0.358359
C  2.079783 -4.434344 -0.597454
C  1.881403 -2.769728 -2.467664
C  2.194876 -2.070241 1.307644
C  -0.706584 -1.801833 -1.072252
C  2.87984 -1.144544 1.966285
C  -3.061496 -1.528411 -1.328994
C  -3.354971 -0.37069 -0.420223
C  -2.850707 0.890828 -0.711245
C  -4.070165 -0.572924 0.756855
C  -3.007884 1.924729 0.201423
C  -4.266499 0.481134 1.636298
C  -3.722255 1.730698 1.374661
C  -1.297477 3.294187 -0.692102
C  -1.196987 4.297562 -1.644133
C  -0.208972 2.478712 -0.401075
C  0.004309 4.486316 -2.313884
C  0.97903 2.667594 -1.09166
C  1.093826 3.668895 -2.047729
H  1.78027 -0.953539 -0.504815
H  -0.075202 -3.255239 0.404022
H  1.787962 -4.703043 0.416574
H  1.673287 -5.195131 -1.265212
H  3.16807 -4.487184 -0.660177
H  2.937539 -2.953766 -2.67081
H  1.302866 -3.428149 -3.118629
H  1.670734 -1.74101 -2.749753
H  2.019997 -3.004214 1.828709
H  -2.890456 -1.209906 -2.357306
H  -3.878319 -2.247334 -1.325664
H  -2.32365 1.056227 -1.641476
H  -4.474595 -1.551595 0.98381
H  -4.83197 0.328433 2.54631
H  -3.85134 2.546367 2.074528
H  -2.052033 4.926262 -1.858832
H  -0.277434 1.700572 0.349106
H  0.080431 5.271555 -3.054778
H  1.823041 2.026105 -0.874164
H  2.025576 3.810488 -2.578566
elementType: Cl O C H
totalener: -1958.43481299 hartree
nucrepener: 2589.63932402 hartree
electener: -4548.07413702 hartree
oneelecener: -7833.69912909 hartree
twoeener: 3285.62499207 hartree
cpcmener: -0.02983327 hartree
kineticenergy: 1952.55923096 hartree
xcener: -143.506176134394 hartree
chargesum: -0.0000000
charge: -0.064323 -0.063169 -0.288111 -0.497935 -0.343816 0.084132 0.027620 -0.051804 -0.269142 -0.269264 -0.194940 0.417609 0.045539 0.085469 -0.015247 -0.171221 -0.237639 0.272631 -0.114702 -0.251014 0.306300 -0.253731 -0.211506 -0.122664 -0.123731 -0.204726 0.068860 0.097014 0.092668 0.098557 0.101099 0.097554 0.101011 0.092683 0.131305 0.118965 0.127492 0.143704 0.147056 0.161339 0.149239 0.148034 0.153878 0.160769 0.156961 0.161195
qa: -0.0643 -0.0632 -0.2881 -0.4979 -0.3438 0.0841 0.0276 -0.0518 -0.2691 -0.2693 -0.1949 0.4176 0.0455 0.0855 -0.0152 -0.1712 -0.2376 0.2726 -0.1147 -0.2510 0.3063 -0.2537 -0.2115 -0.1227 -0.1237 -0.2047 0.0689 0.0970 0.0927 0.0986 0.1011 0.0976 0.1010 0.0927 0.1313 0.1190 0.1275 0.1437 0.1471 0.1613 0.1492 0.1480 0.1539 0.1608 0.1570 0.1612
va: 1.2700 1.2420 2.1325 1.9927 2.0666 3.7419 3.8910 3.8066 3.9116 3.8982 3.8889 4.1455 4.1888 3.7933 3.6463 3.8617 3.9805 3.7267 3.8794 4.0209 3.6809 4.0130 3.8805 3.8771 3.8517 3.9602 1.0302 1.0317 1.0054 1.0009 1.0004 1.0000 0.9989 1.0194 1.0184 1.0114 0.9949 1.0222 1.0024 0.9871 1.0051 1.0072 1.0010 0.9878 0.9909 0.9905
dispcorr: -0.024504552 hartree
energy: -1958.459317546579
dipole: -13.12625 12.64849 -0.47775 -10.79647 8.81282 -1.98365 -22.00683 21.73583 -0.27100
magnitude: 2.05829 au
magnitude: 5.23175 debye
