program: Orca
programVersion: 5.0.3
elementType: Cl Cl O O O C C C C C C C C C C C C C C C C C C C C C H H H H H H H H H H H H H H H H H H H H
charge: 0
multiplicity: 1
keywords: wb97x-d3
keywords: def2-TZVPP
keywords: def2/J RIJCOSX
keywords: DEFGRID2
keywords: scfconv7
keywords: smallprint printgap noloewdin
keywords: NOSOSCF
formula: C21H20Cl2O3
InChI: InChI=1/C21H20Cl2O3/c1-21(2)17(12-18(22)23)19(21)20(24)25-13-14-7-6-10-16(11-14)26-15-8-4-3-5-9-15/h3-12,17,19H,13H2,1-2H3
46 atoms
Cl 1.931317 0.818609 0.251121
Cl 3.786088 -0.125978 2.25052
O  -1.928146 -2.654896 0.43823
O  -1.279369 -2.178402 -1.646141
O  -1.572332 2.330257 1.24726
C  1.396981 -3.606198 -0.916553
C  1.515687 -2.199999 -0.422172
C  0.294499 -3.044062 -0.050235
C  2.221013 -4.696961 -0.273354
C  1.209135 -3.822108 -2.398801
C  2.440969 -1.796352 0.644721
C  -1.01991 -2.590711 -0.539556
C  2.688187 -0.538015 0.988184
C  -3.233021 -2.151602 0.166459
C  -3.279567 -0.653471 0.035335
C  -2.352356 0.167688 0.669888
C  -4.311009 -0.076289 -0.696997
C  -2.475146 1.543699 0.567557
C  -4.425755 1.303856 -0.782951
C  -3.507502 2.127741 -0.150888
C  -0.634029 3.036179 0.545003
C  0.117993 3.945676 1.280898
C  -0.394446 2.858976 -0.812247
C  1.117045 4.672975 0.654514
C  0.608385 3.600741 -1.42534
C  1.368979 4.506972 -0.702146
H  1.307077 -1.441354 -1.168666
H  0.284242 -3.413367 0.968532
H  1.788885 -5.672327 -0.501853
H  3.240827 -4.686936 -0.66173
H  2.272177 -4.613983 0.811751
H  0.759401 -2.973129 -2.906604
H  2.18274 -4.000067 -2.858466
H  0.591359 -4.701154 -2.588716
H  2.952622 -2.568879 1.206339
H  -3.656217 -2.627087 -0.720609
H  -3.830638 -2.468279 1.021766
H  -1.534989 -0.245658 1.248707
H  -5.030697 -0.708803 -1.202228
H  -5.235325 1.742352 -1.351125
H  -3.591303 3.205239 -0.216291
H  -0.076477 4.073505 2.338663
H  -0.962953 2.14764 -1.396485
H  1.700744 5.376982 1.233256
H  0.794177 3.457274 -2.48203
H  2.148515 5.078279 -1.188141
elementType: Cl O C H
totalener: -1958.43475467 hartree
nucrepener: 2646.36344897 hartree
electener: -4604.79820365 hartree
oneelecener: -7947.52515028 hartree
twoeener: 3342.72694663 hartree
cpcmener: -0.03155702 hartree
kineticenergy: 1952.55385464 hartree
xcener: -143.508754971775 hartree
chargesum: 0.0000000
charge: -0.049987 -0.062861 -0.298260 -0.485845 -0.334863 0.128463 -0.044145 -0.048070 -0.288116 -0.275030 -0.169810 0.395110 0.040123 0.102304 0.007392 -0.224833 -0.199281 0.230462 -0.136612 -0.177485 0.325644 -0.256613 -0.237369 -0.119935 -0.156908 -0.196263 0.095940 0.099742 0.100233 0.105542 0.092737 0.093165 0.096595 0.101911 0.131670 0.119142 0.125847 0.130631 0.146007 0.162255 0.157636 0.145530 0.145913 0.159945 0.161444 0.160903
qa: -0.0500 -0.0629 -0.2983 -0.4858 -0.3349 0.1285 -0.0441 -0.0481 -0.2881 -0.2750 -0.1698 0.3951 0.0401 0.1023 0.0074 -0.2248 -0.1993 0.2305 -0.1366 -0.1775 0.3256 -0.2566 -0.2374 -0.1199 -0.1569 -0.1963 0.0959 0.0997 0.1002 0.1055 0.0927 0.0932 0.0966 0.1019 0.1317 0.1191 0.1258 0.1306 0.1460 0.1623 0.1576 0.1455 0.1459 0.1599 0.1614 0.1609
va: 1.3006 1.2448 2.1152 2.0091 2.0528 3.7711 3.9118 3.7895 3.9174 3.8847 3.8769 4.1432 4.2148 3.7840 3.6500 4.0371 3.9562 3.7411 3.8836 3.9587 3.5907 3.9942 3.8292 3.8878 3.8738 3.8959 1.0359 1.0336 1.0012 0.9989 1.0030 1.0202 1.0001 0.9993 1.0182 1.0098 0.9920 1.0295 1.0008 0.9885 0.9962 1.0094 1.0110 0.9875 0.9896 0.9887
dispcorr: -0.025463824 hartree
energy: -1958.460218495137
dipole: -11.16622 10.87672 -0.28950 -15.09486 13.60455 -1.49032 -14.58423 14.56028 -0.02395
magnitude: 1.51836 au
magnitude: 3.85938 debye
