program: Orca
programVersion: 5.0.3
elementType: Cl Cl O O O C C C C C C C C C C C C C C C C C C C C C H H H H H H H H H H H H H H H H H H H H
charge: 0
multiplicity: 1
keywords: wb97x-d3
keywords: def2-TZVPP
keywords: def2/J RIJCOSX
keywords: DEFGRID2
keywords: scfconv7
keywords: smallprint printgap noloewdin
keywords: NOSOSCF
formula: C21H20Cl2O3
InChI: InChI=1/C21H20Cl2O3/c1-21(2)17(12-18(22)23)19(21)20(24)25-13-14-7-6-10-16(11-14)26-15-8-4-3-5-9-15/h3-12,17,19H,13H2,1-2H3
46 atoms
Cl 4.893121 -2.428687 -1.866277
Cl 5.165318 -5.085412 -0.777708
O  -0.41267 -1.234755 1.499934
O  0.718158 -0.119215 -0.072505
O  -3.092352 3.863138 -0.134943
C  0.453437 -2.962326 -1.461336
C  1.867819 -2.698069 -1.026504
C  0.734554 -2.517353 -0.040045
C  -0.037429 -4.379872 -1.626473
C  -0.161802 -2.007925 -2.454535
C  2.824196 -3.785846 -0.791032
C  0.37429 -1.165389 0.426702
C  4.112827 -3.760949 -1.105604
C  -0.953727 -0.011615 2.000662
C  -1.982088 0.576593 1.075202
C  -2.026992 1.95407 0.903771
C  -2.905571 -0.23481 0.421504
C  -3.017452 2.517658 0.108514
C  -3.870006 0.339302 -0.392408
C  -3.941268 1.715902 -0.545489
C  -2.779681 4.78146 0.834681
C  -2.175145 5.954679 0.404354
C  -3.106683 4.602597 2.17364
C  -1.895609 6.956693 1.322018
C  -2.807571 5.608452 3.082059
C  -2.203365 6.78697 2.664981
H  2.289337 -1.775799 -1.409678
H  0.616812 -3.295087 0.706137
H  0.329322 -5.054471 -0.854204
H  -1.127689 -4.40309 -1.587053
H  0.267422 -4.779042 -2.595518
H  0.265133 -1.008629 -2.415295
H  -0.008112 -2.388564 -3.465558
H  -1.238507 -1.924011 -2.293333
H  2.459456 -4.684429 -0.308102
H  -1.412959 -0.286449 2.950461
H  -0.160406 0.707281 2.213866
H  -1.286233 2.576606 1.391469
H  -2.880536 -1.310007 0.543169
H  -4.587237 -0.28937 -0.903352
H  -4.701113 2.164401 -1.172492
H  -1.93213 6.082687 -0.642824
H  -3.593594 3.697484 2.513305
H  -1.426637 7.870724 0.98221
H  -3.060168 5.468328 4.12495
H  -1.978231 7.5670 3.379622
elementType: Cl O C H
totalener: -1958.43596979 hartree
nucrepener: 2419.08704310 hartree
electener: -4377.52301289 hartree
oneelecener: -7492.18131904 hartree
twoeener: 3114.65830615 hartree
cpcmener: -0.03238329 hartree
kineticenergy: 1952.56167746 hartree
xcener: -143.508413477107 hartree
chargesum: 0.0000000
charge: -0.058103 -0.062879 -0.290179 -0.482889 -0.337671 0.093313 0.024572 -0.066892 -0.267917 -0.266672 -0.200855 0.397453 0.038540 0.102720 0.046005 -0.229382 -0.279076 0.306735 -0.102661 -0.268117 0.311266 -0.264473 -0.211915 -0.118597 -0.142170 -0.196290 0.075230 0.099412 0.092906 0.098584 0.101227 0.093425 0.102679 0.095466 0.132445 0.124943 0.118335 0.144948 0.144743 0.161123 0.149003 0.148093 0.158636 0.161182 0.162728 0.161020
qa: -0.0581 -0.0629 -0.2902 -0.4829 -0.3377 0.0933 0.0246 -0.0669 -0.2679 -0.2667 -0.2009 0.3975 0.0385 0.1027 0.0460 -0.2294 -0.2791 0.3067 -0.1027 -0.2681 0.3113 -0.2645 -0.2119 -0.1186 -0.1422 -0.1963 0.0752 0.0994 0.0929 0.0986 0.1012 0.0934 0.1027 0.0955 0.1324 0.1249 0.1183 0.1449 0.1447 0.1611 0.1490 0.1481 0.1586 0.1612 0.1627 0.1610
va: 1.2677 1.2421 2.1192 2.0201 2.0688 3.7330 3.8910 3.8099 3.9063 3.8996 3.8970 4.1912 4.2068 3.7861 3.5992 3.9650 3.9476 3.6813 3.8758 4.0225 3.6619 4.0092 3.9129 3.8740 3.8825 3.9061 1.0507 1.0330 1.0052 1.0012 1.0009 1.0181 1.0011 1.0019 1.0177 0.9917 1.0102 1.0072 1.0119 0.9875 1.0062 1.0082 0.9967 0.9880 0.9889 0.9897
dispcorr: -0.022121941 hartree
energy: -1958.458091732710
dipole: -35.54086 34.02879 -1.51207 14.82861 -15.77513 -0.94652 4.65945 -3.58141 1.07805
magnitude: 2.08433 au
magnitude: 5.29795 debye
