program: Orca
programVersion: 5.0.3
elementType: Cl Cl O O O C C C C C C C C C C C C C C C C C C C C C H H H H H H H H H H H H H H H H H H H H
charge: 0
multiplicity: 1
keywords: wb97x-d3
keywords: def2-TZVPP
keywords: def2/J RIJCOSX
keywords: DEFGRID2
keywords: scfconv7
keywords: smallprint printgap noloewdin
keywords: NOSOSCF
formula: C21H20Cl2O3
InChI: InChI=1/C21H20Cl2O3/c1-21(2)17(12-18(22)23)19(21)20(24)25-13-14-7-6-10-16(11-14)26-15-8-4-3-5-9-15/h3-12,17,19H,13H2,1-2H3
46 atoms
Cl 2.348368 -5.233476 -0.992781
Cl 4.936184 -4.234157 -1.779642
O  -0.613937 0.336968 -1.943083
O  -1.200835 -1.656796 -1.119341
O  -2.452394 2.640834 2.258707
C  1.469174 -1.07016 0.497922
C  1.650374 -2.20773 -0.468312
C  1.067835 -0.899671 -0.954137
C  2.657806 -0.260727 0.954701
C  0.417007 -1.228126 1.568012
C  2.975253 -2.608613 -0.953745
C  -0.355009 -0.820444 -1.335009
C  3.358967 -3.854831 -1.198846
C  -1.981601 0.646383 -2.220559
C  -2.765988 0.910998 -0.965693
C  -2.211619 1.674084 0.057788
C  -4.056333 0.412406 -0.835315
C  -2.961387 1.941946 1.194692
C  -4.794564 0.687878 0.307129
C  -4.255628 1.456729 1.326301
C  -1.631591 3.721725 2.053484
C  -0.589423 3.897434 2.953221
C  -1.855743 4.64388 1.03811
C  0.235331 5.007423 2.834435
C  -1.014442 5.7415 0.923963
C  0.032787 5.929531 1.816732
H  0.930657 -3.010352 -0.35462
H  1.725865 -0.259032 -1.53044
H  3.18604 -0.775558 1.7595
H  3.372023 -0.060045 0.157397
H  2.323714 0.703578 1.341665
H  -0.023805 -0.261894 1.824251
H  -0.387514 -1.903381 1.284684
H  0.87772 -1.631312 2.47172
H  3.705517 -1.829978 -1.139911
H  -1.936852 1.542104 -2.840123
H  -2.447932 -0.143165 -2.812864
H  -1.201463 2.055796 -0.03074
H  -4.48243 -0.194342 -1.624334
H  -5.798888 0.298367 0.408167
H  -4.827949 1.672333 2.219608
H  -0.429458 3.173874 3.742349
H  -2.675685 4.517824 0.342736
H  1.045723 5.144125 3.538317
H  -1.187781 6.457984 0.131751
H  0.681981 6.789504 1.721879
elementType: Cl O C H
totalener: -1958.43624879 hartree
nucrepener: 2492.35523235 hartree
electener: -4450.79148114 hartree
oneelecener: -7638.52790260 hartree
twoeener: 3187.73642146 hartree
cpcmener: -0.03190350 hartree
kineticenergy: 1952.55457235 hartree
xcener: -143.506835164080 hartree
chargesum: -0.0000000
charge: -0.058840 -0.063089 -0.290985 -0.480549 -0.345198 0.097410 0.021832 -0.067257 -0.269565 -0.268675 -0.201204 0.395778 0.039504 0.106269 0.043598 -0.265450 -0.230236 0.306983 -0.111983 -0.262113 0.301134 -0.262849 -0.198158 -0.119225 -0.145581 -0.194026 0.076082 0.100087 0.101223 0.093660 0.097100 0.094733 0.094271 0.103895 0.132257 0.124106 0.118258 0.140580 0.145665 0.161065 0.149036 0.147725 0.157285 0.161398 0.162627 0.161420
qa: -0.0588 -0.0631 -0.2910 -0.4805 -0.3452 0.0974 0.0218 -0.0673 -0.2696 -0.2687 -0.2012 0.3958 0.0395 0.1063 0.0436 -0.2655 -0.2302 0.3070 -0.1120 -0.2621 0.3011 -0.2628 -0.1982 -0.1192 -0.1456 -0.1940 0.0761 0.1001 0.1012 0.0937 0.0971 0.0947 0.0943 0.1039 0.1323 0.1241 0.1183 0.1406 0.1457 0.1611 0.1490 0.1477 0.1573 0.1614 0.1626 0.1614
va: 1.2670 1.2420 2.1144 2.0219 2.0470 3.7294 3.8932 3.8000 3.9067 3.9016 3.9013 4.2045 4.2067 3.7845 3.6070 3.9094 3.9686 3.6611 3.8827 4.0201 3.6670 4.0003 3.9076 3.8757 3.8856 3.9040 1.0504 1.0323 1.0006 1.0053 1.0020 1.0008 1.0176 1.0013 1.0180 0.9928 1.0086 1.0181 1.0023 0.9877 1.0057 1.0084 0.9974 0.9877 0.9890 0.9894
dispcorr: -0.023107720 hartree
energy: -1958.459356506084
dipole: -17.20900 17.52124 0.31224 33.92972 -31.80355 2.12617 13.54973 -13.78877 -0.23904
magnitude: 2.16223 au
magnitude: 5.49595 debye
