program: Orca
programVersion: 5.0.3
elementType: Cl Cl O O O C C C C C C C C C C C C C C C C C C C C C H H H H H H H H H H H H H H H H H H H H
charge: 0
multiplicity: 1
keywords: wb97x-d3
keywords: def2-TZVPP
keywords: def2/J RIJCOSX
keywords: DEFGRID2
keywords: scfconv7
keywords: smallprint printgap noloewdin
keywords: NOSOSCF
formula: C21H20Cl2O3
InChI: InChI=1/C21H20Cl2O3/c1-21(2)17(12-18(22)23)19(21)20(24)25-13-14-7-6-10-16(11-14)26-15-8-4-3-5-9-15/h3-12,17,19H,13H2,1-2H3
46 atoms
Cl 2.544029 -5.465263 0.300323
Cl 4.381563 -5.357591 -1.921299
O  -1.156791 -0.75557 -1.943884
O  -1.083616 -1.980252 -0.076642
O  -1.102187 3.400397 0.824083
C  1.944211 -1.034915 -0.3240
C  1.797947 -2.51559 -0.547373
C  0.922204 -1.551791 -1.316558
C  3.120228 -0.289156 -0.905892
C  1.504413 -0.487593 1.012068
C  2.805027 -3.291402 -1.280181
C  -0.52425 -1.481181 -1.021485
C  3.184585 -4.530924 -0.9959
C  -2.536823 -0.464312 -1.718111
C  -2.732936 0.483618 -0.567121
C  -1.869703 1.55985 -0.392988
C  -3.793172 0.30842 0.313199
C  -2.051533 2.431123 0.670651
C  -3.979438 1.20042 1.360289
C  -3.108655 2.261297 1.557444
C  -1.416412 4.654962 1.264458
C  -2.581031 5.316179 0.89228
C  -0.467312 5.286554 2.057944
C  -2.787231 6.617981 1.32822
C  -0.681974 6.591531 2.47481
C  -1.843867 7.262018 2.117379
H  1.295701 -3.041196 0.256657
H  1.176448 -1.385338 -2.357737
H  3.375674 -0.60825 -1.91571
H  2.898995 0.778715 -0.951792
H  4.005717 -0.415751 -0.280002
H  2.352509 -0.475086 1.699484
H  1.145902 0.539415 0.913131
H  0.717227 -1.074873 1.480266
H  3.283274 -2.823596 -2.132593
H  -2.875235 -0.01172 -2.650601
H  -3.109498 -1.382078 -1.569799
H  -1.038906 1.723374 -1.069578
H  -4.46681 -0.530563 0.190122
H  -4.80138 1.055628 2.049388
H  -3.249357 2.931406 2.396005
H  -3.318894 4.834242 0.263131
H  0.436475 4.759035 2.33678
H  -3.693261 7.133923 1.037308
H  0.063198 7.082642 3.087378
H  -2.010787 8.278998 2.447102
elementType: Cl O C H
totalener: -1958.45008662 hartree
nucrepener: 2442.06749710 hartree
electener: -4400.51758372 hartree
oneelecener: -7538.02646777 hartree
twoeener: 3137.50888405 hartree
cpcmener: -0.02625390 hartree
kineticenergy: 1952.55460292 hartree
xcener: -143.505544991132 hartree
chargesum: 0.0000000
charge: -0.056299 -0.062658 -0.286489 -0.448763 -0.330474 0.094028 0.025722 -0.063024 -0.269485 -0.269775 -0.203571 0.368396 0.041748 0.102213 0.070626 -0.334281 -0.226386 0.327364 -0.117101 -0.225560 0.292663 -0.202712 -0.254428 -0.147617 -0.122550 -0.185534 0.075359 0.097326 0.091531 0.098173 0.101535 0.102680 0.093735 0.096241 0.127337 0.121798 0.115243 0.128881 0.141420 0.158735 0.157481 0.156501 0.145563 0.159051 0.157496 0.157863
qa: -0.0563 -0.0627 -0.2865 -0.4488 -0.3305 0.0940 0.0257 -0.0630 -0.2695 -0.2698 -0.2036 0.3684 0.0417 0.1022 0.0706 -0.3343 -0.2264 0.3274 -0.1171 -0.2256 0.2927 -0.2027 -0.2544 -0.1476 -0.1226 -0.1855 0.0754 0.0973 0.0915 0.0982 0.1015 0.1027 0.0937 0.0962 0.1273 0.1218 0.1152 0.1289 0.1414 0.1587 0.1575 0.1565 0.1456 0.1591 0.1575 0.1579
va: 1.2695 1.2418 2.1168 2.0589 2.0557 3.7360 3.8856 3.7965 3.9046 3.9010 3.8987 4.2388 4.2086 3.7918 3.5928 4.0403 3.9860 3.6623 3.8911 3.9545 3.6963 3.9117 4.0048 3.8976 3.8888 3.9050 1.0517 1.0321 1.0054 1.0016 1.0007 1.0015 1.0028 1.0177 1.0199 0.9922 1.0091 1.0314 1.0038 0.9900 0.9960 0.9982 1.0083 0.9904 0.9896 0.9906
dispcorr: -0.022466852 hartree
energy: -1958.472553471333
dipole: -16.79303 16.31170 -0.48134 40.42937 -38.60900 1.82037 7.04405 -7.66429 -0.62024
magnitude: 1.98246 au
magnitude: 5.03901 debye
