program: Orca
programVersion: 5.0.3
elementType: Cl Cl O O O C C C C C C C C C C C C C C C C C C C C C H H H H H H H H H H H H H H H H H H H H
charge: 0
multiplicity: 1
keywords: wb97x-d3
keywords: def2-TZVPP
keywords: def2/J RIJCOSX
keywords: DEFGRID2
keywords: scfconv7
keywords: smallprint printgap noloewdin
keywords: NOSOSCF
formula: C21H20Cl2O3
InChI: InChI=1/C21H20Cl2O3/c1-21(2)17(12-18(22)23)19(21)20(24)25-13-14-7-6-10-16(11-14)26-15-8-4-3-5-9-15/h3-12,17,19H,13H2,1-2H3
46 atoms
Cl 3.381407 -0.550839 1.970523
Cl 3.344124 -3.048828 3.413454
O  -1.782033 -2.004359 -1.271751
O  -0.254684 -0.416026 -1.649714
O  -2.719081 3.46765 0.221694
C  1.740073 -2.824432 -1.538605
C  1.72798 -2.119871 -0.212658
C  0.420051 -2.566918 -0.843946
C  2.167387 -4.27061 -1.616617
C  2.152737 -2.025402 -2.750555
C  2.171149 -2.771919 1.024136
C  -0.536371 -1.536779 -1.299245
C  2.868813 -2.194206 1.994299
C  -2.849689 -1.100727 -1.595452
C  -3.076959 -0.113848 -0.486051
C  -2.808057 1.233333 -0.684425
C  -3.526704 -0.554021 0.756146
C  -2.957334 2.12999 0.36613
C  -3.696695 0.353075 1.789964
C  -3.402309 1.696714 1.60608
C  -1.659215 3.914846 -0.517688
C  -1.829432 5.1273 -1.173034
C  -0.444083 3.241818 -0.582278
C  -0.778362 5.667062 -1.899274
C  0.593631 3.788726 -1.323856
C  0.434716 4.998079 -1.986505
H  1.911423 -1.05308 -0.272436
H  -0.042595 -3.445831 -0.409226
H  1.787028 -4.876475 -0.79484
H  1.803759 -4.719024 -2.542905
H  3.256129 -4.350261 -1.615487
H  3.222436 -2.15864 -2.923122
H  1.630367 -2.373811 -3.64377
H  1.970549 -0.958643 -2.647335
H  1.908209 -3.812748 1.170929
H  -2.655739 -0.598659 -2.544709
H  -3.717065 -1.746212 -1.728043
H  -2.469799 1.573661 -1.655359
H  -3.745733 -1.602889 0.915729
H  -4.05113 0.01389 2.754653
H  -3.519446 2.404918 2.416783
H  -2.778935 5.644312 -1.110085
H  -0.295734 2.30317 -0.063617
H  -0.916008 6.612871 -2.407476
H  1.537178 3.260625 -1.375269
H  1.250102 5.416874 -2.561442
elementType: Cl O C H
totalener: -1958.44974282 hartree
nucrepener: 2521.99321954 hartree
electener: -4480.44296236 hartree
oneelecener: -7698.20962243 hartree
twoeener: 3217.76666007 hartree
cpcmener: -0.02478517 hartree
kineticenergy: 1952.56726785 hartree
xcener: -143.506954827843 hartree
chargesum: -0.0000000
charge: -0.056333 -0.061815 -0.284980 -0.470993 -0.329729 0.088906 0.021752 -0.075687 -0.267599 -0.270217 -0.201502 0.409606 0.041847 0.088344 0.007338 -0.189249 -0.245276 0.283862 -0.109407 -0.251287 0.307195 -0.260831 -0.203121 -0.116048 -0.139711 -0.193561 0.083193 0.092448 0.091292 0.098079 0.100745 0.095847 0.099580 0.095543 0.127873 0.114610 0.128745 0.139864 0.141518 0.156883 0.146079 0.144081 0.150295 0.156966 0.157664 0.157191
qa: -0.0563 -0.0618 -0.2850 -0.4710 -0.3297 0.0889 0.0218 -0.0757 -0.2676 -0.2702 -0.2015 0.4096 0.0418 0.0883 0.0073 -0.1892 -0.2453 0.2839 -0.1094 -0.2513 0.3072 -0.2608 -0.2031 -0.1160 -0.1397 -0.1936 0.0832 0.0924 0.0913 0.0981 0.1007 0.0958 0.0996 0.0955 0.1279 0.1146 0.1287 0.1399 0.1415 0.1569 0.1461 0.1441 0.1503 0.1570 0.1577 0.1572
va: 1.2689 1.2430 2.1288 2.0321 2.0828 3.7256 3.8747 3.8319 3.9102 3.9020 3.8994 4.1609 4.2105 3.8057 3.6067 3.9039 3.9753 3.7223 3.8819 4.0240 3.6867 4.0090 3.8966 3.8811 3.8908 3.9127 1.0409 1.0342 1.0054 1.0012 1.0009 1.0001 0.9991 1.0202 1.0195 1.0092 0.9915 1.0140 1.0071 0.9889 1.0064 1.0093 1.0068 0.9891 0.9912 0.9908
dispcorr: -0.022560607 hartree
energy: -1958.472303425103
dipole: -12.72073 12.25100 -0.46973 0.42590 -2.02557 -1.59967 -26.78346 25.89766 -0.88580
magnitude: 1.88792 au
magnitude: 4.79871 debye
