program: Orca
programVersion: 5.0.3
elementType: Cl Cl O O O C C C C C C C C C C C C C C C C C C C C C H H H H H H H H H H H H H H H H H H H H
charge: 0
multiplicity: 1
keywords: wb97x-d3
keywords: def2-TZVPP
keywords: def2/J RIJCOSX
keywords: DEFGRID2
keywords: scfconv7
keywords: smallprint printgap noloewdin
keywords: NOSOSCF
formula: C21H20Cl2O3
InChI: InChI=1/C21H20Cl2O3/c1-21(2)17(12-18(22)23)19(21)20(24)25-13-14-7-6-10-16(11-14)26-15-8-4-3-5-9-15/h3-12,17,19H,13H2,1-2H3
46 atoms
Cl 4.880922 -1.572297 -0.350163
Cl 5.226841 -4.415394 -0.009903
O  -1.419677 -1.809876 1.145022
O  0.055679 -0.212733 0.622372
O  -3.452377 3.606772 0.028313
C  0.669895 -2.445274 -1.581353
C  1.815727 -2.262042 -0.621857
C  0.416953 -2.47374 -0.088622
C  0.489591 -3.752321 -2.312985
C  0.255233 -1.246112 -2.399073
C  2.818109 -3.311997 -0.402871
C  -0.296434 -1.366172 0.583944
C  4.124635 -3.117005 -0.274616
C  -2.285617 -0.849403 1.76021
C  -2.942224 0.042666 0.744317
C  -2.856158 1.42178 0.876988
C  -3.640237 -0.509877 -0.326305
C  -3.454374 2.245398 -0.069221
C  -4.235481 0.321504 -1.261803
C  -4.139593 1.700243 -1.145412
C  -2.376589 4.295443 0.514126
C  -1.060474 3.903913 0.295857
C  -2.658821 5.472493 1.196096
C  -0.03031 4.700038 0.777781
C  -1.618393 6.262557 1.660543
C  -0.299328 5.878795 1.459594
H  2.181448 -1.243968 -0.554121
H  0.194806 -3.456508 0.313163
H  0.707526 -4.623335 -1.695891
H  -0.54234 -3.849116 -2.655496
H  1.134671 -3.795105 -3.192655
H  0.770228 -1.262692 -3.361327
H  -0.818009 -1.263329 -2.599989
H  0.492429 -0.297364 -1.921657
H  2.471433 -4.336185 -0.331831
H  -3.027199 -1.453437 2.282734
H  -1.744386 -0.266052 2.507586
H  -2.317939 1.84427 1.717012
H  -3.722253 -1.584874 -0.430344
H  -4.777769 -0.104248 -2.096103
H  -4.598733 2.351214 -1.87895
H  -0.82805 2.992004 -0.240163
H  -3.688816 5.768591 1.352715
H  0.993881 4.391882 0.610774
H  -1.84438 7.180919 2.18729
H  0.511146 6.493729 1.828004
elementType: Cl O C H
totalener: -1958.44987856 hartree
nucrepener: 2469.90971754 hartree
electener: -4428.35959610 hartree
oneelecener: -7593.78866920 hartree
twoeener: 3165.42907311 hartree
cpcmener: -0.02540129 hartree
kineticenergy: 1952.55661927 hartree
xcener: -143.505383628330 hartree
chargesum: 0.0000000
charge: -0.056504 -0.061862 -0.280014 -0.455780 -0.326396 0.091021 0.027134 -0.076939 -0.266837 -0.262635 -0.204811 0.383272 0.040221 0.088119 0.042332 -0.226344 -0.274970 0.307958 -0.097320 -0.261787 0.316707 -0.214254 -0.265546 -0.140578 -0.113685 -0.194758 0.075844 0.097916 0.090065 0.098623 0.100847 0.100425 0.095236 0.093269 0.129261 0.125976 0.115568 0.144383 0.139164 0.157128 0.146268 0.156561 0.143901 0.158614 0.157486 0.157722
qa: -0.0565 -0.0619 -0.2800 -0.4558 -0.3264 0.0910 0.0271 -0.0769 -0.2668 -0.2626 -0.2048 0.3833 0.0402 0.0881 0.0423 -0.2263 -0.2750 0.3080 -0.0973 -0.2618 0.3167 -0.2143 -0.2655 -0.1406 -0.1137 -0.1948 0.0758 0.0979 0.0901 0.0986 0.1008 0.1004 0.0952 0.0933 0.1293 0.1260 0.1156 0.1444 0.1392 0.1571 0.1463 0.1566 0.1439 0.1586 0.1575 0.1577
va: 1.2692 1.2429 2.1213 2.0522 2.0859 3.7395 3.8761 3.8010 3.9033 3.9081 3.8972 4.2317 4.2098 3.8023 3.6008 3.9364 3.9572 3.7012 3.8727 4.0239 3.6746 3.9100 4.0123 3.8917 3.8781 3.9142 1.0504 1.0324 1.0055 1.0010 1.0013 1.0016 1.0016 1.0156 1.0185 0.9915 1.0091 1.0075 1.0119 0.9887 1.0072 1.0000 1.0098 0.9905 0.9890 0.9906
dispcorr: -0.022680489 hartree
energy: -1958.472559051734
dipole: -31.23018 30.06311 -1.16707 11.50933 -12.65048 -1.14115 -7.15968 6.96016 -0.19951
magnitude: 1.64441 au
magnitude: 4.17976 debye
