program: Orca
programVersion: 5.0.3
elementType: Cl Cl O O O C C C C C C C C C C C C C C C C C C C C C H H H H H H H H H H H H H H H H H H H H
charge: 0
multiplicity: 1
keywords: wb97x-d3
keywords: def2-TZVPP
keywords: def2/J RIJCOSX
keywords: DEFGRID2
keywords: scfconv7
keywords: smallprint printgap noloewdin
keywords: NOSOSCF
formula: C21H20Cl2O3
InChI: InChI=1/C21H20Cl2O3/c1-21(2)17(12-18(22)23)19(21)20(24)25-13-14-7-6-10-16(11-14)26-15-8-4-3-5-9-15/h3-12,17,19H,13H2,1-2H3
46 atoms
Cl 1.862962 -3.717451 -2.086518
Cl 4.742758 -3.507619 -2.174043
O  -1.101209 -0.761966 -1.30604
O  -0.960882 -2.067513 0.510315
O  -2.835602 2.87275 1.798932
C  1.758522 -0.456415 0.800729
C  2.004796 -1.859331 0.358974
C  0.997398 -1.024211 -0.39061
C  2.772238 0.60781 0.461077
C  1.06169 -0.217792 2.115938
C  3.256331 -2.254791 -0.324817
C  -0.435677 -1.361871 -0.315956
C  3.284231 -3.054436 -1.381085
C  -2.513643 -0.901558 -1.386039
C  -3.238874 0.239951 -0.723539
C  -2.638733 1.041182 0.238682
C  -4.561618 0.478582 -1.088504
C  -3.357827 2.082116 0.81572
C  -5.271303 1.509195 -0.494676
C  -4.674088 2.325189 0.454455
C  -1.509167 3.203875 1.817564
C  -0.806621 3.544228 0.666943
C  -0.895432 3.256246 3.06168
C  0.522661 3.927052 0.774025
C  0.430199 3.655869 3.15452
C  1.147643 3.985016 2.012977
H  1.575784 -2.630491 0.994726
H  1.31465 -0.631436 -1.350101
H  3.240483 0.449881 -0.511436
H  2.297117 1.590205 0.442032
H  3.564533 0.639788 1.212187
H  0.370065 -1.012552 2.387902
H  1.802994 -0.144891 2.914645
H  0.508179 0.7240 2.098053
H  4.201785 -1.890106 0.060935
H  -2.748062 -0.916517 -2.451037
H  -2.839142 -1.857343 -0.968895
H  -1.61499 0.875165 0.547505
H  -5.03429 -0.139399 -1.842529
H  -6.29789 1.69289 -0.784017
H  -5.222022 3.139618 0.911112
H  -1.284102 3.518951 -0.304489
H  -1.455553 2.99211 3.95011
H  1.068987 4.191267 -0.122576
H  0.904698 3.699426 4.126421
H  2.18367 4.288402 2.086746
elementType: Cl O C H
totalener: -1958.44707907 hartree
nucrepener: 2584.32353813 hartree
electener: -4542.77061720 hartree
oneelecener: -7822.21333089 hartree
twoeener: 3279.44271369 hartree
cpcmener: -0.02442563 hartree
kineticenergy: 1952.56497271 hartree
xcener: -143.510555426738 hartree
chargesum: 0.0000000
charge: -0.050975 -0.056945 -0.280665 -0.452171 -0.325275 0.160876 -0.030776 -0.144828 -0.295565 -0.238411 -0.223139 0.378727 0.074976 0.081949 0.030631 -0.203241 -0.240037 0.296127 -0.106304 -0.259747 0.289734 -0.197148 -0.222600 -0.147974 -0.124245 -0.194739 0.110764 0.110386 0.098865 0.093095 0.104049 0.102028 0.106198 0.034520 0.139483 0.123415 0.114625 0.130453 0.140450 0.156233 0.144119 0.154930 0.143226 0.160898 0.155915 0.158114
qa: -0.0510 -0.0569 -0.2807 -0.4522 -0.3253 0.1609 -0.0308 -0.1448 -0.2956 -0.2384 -0.2231 0.3787 0.0750 0.0819 0.0306 -0.2032 -0.2400 0.2961 -0.1063 -0.2597 0.2897 -0.1971 -0.2226 -0.1480 -0.1242 -0.1947 0.1108 0.1104 0.0989 0.0931 0.1040 0.1020 0.1062 0.0345 0.1395 0.1234 0.1146 0.1305 0.1404 0.1562 0.1441 0.1549 0.1432 0.1609 0.1559 0.1581
va: 1.2797 1.2493 2.1181 2.0502 2.0893 3.6647 3.8839 3.8202 3.9142 3.8724 3.9105 4.1964 4.1845 3.8397 3.6773 3.9427 3.9717 3.7294 3.8895 4.0048 3.6811 3.8870 3.9512 3.8334 3.8551 3.8570 1.0252 1.0260 1.0013 1.0132 0.9994 1.0234 1.0038 1.0258 1.0087 0.9932 1.0125 0.9864 1.0020 0.9892 1.0088 0.9963 1.0089 0.9899 0.9900 0.9909
dispcorr: -0.026570495 hartree
energy: -1958.473649562922
dipole: -12.19580 12.75811 0.56231 27.61532 -26.48788 1.12744 18.04864 -18.31229 -0.26365
magnitude: 1.28717 au
magnitude: 3.27174 debye
