program: Orca
programVersion: 5.0.3
elementType: Cl Cl O O O C C C C C C C C C C C C C C C C C C C C C H H H H H H H H H H H H H H H H H H H H
charge: 0
multiplicity: 1
keywords: wb97x-d3
keywords: def2-TZVPP
keywords: def2/J RIJCOSX
keywords: DEFGRID2
keywords: scfconv7
keywords: smallprint printgap noloewdin
keywords: NOSOSCF
formula: C21H20Cl2O3
InChI: InChI=1/C21H20Cl2O3/c1-21(2)17(12-18(22)23)19(21)20(24)25-13-14-7-6-10-16(11-14)26-15-8-4-3-5-9-15/h3-12,17,19H,13H2,1-2H3
46 atoms
Cl 4.691267 -2.908972 -2.143566
Cl 5.838671 -2.608717 0.484848
O  -1.032632 -0.936267 -0.249041
O  -0.230301 -1.795259 -2.146373
O  -3.130048 3.717553 1.872762
C  0.845434 -3.989986 -0.134765
C  1.943326 -3.086586 -0.620595
C  0.676616 -2.488045 -0.040262
C  1.001399 -4.724819 1.174887
C  0.088902 -4.784501 -1.170702
C  3.204831 -2.916992 0.109212
C  -0.220655 -1.730031 -0.93991
C  4.406491 -2.827694 -0.447471
C  -1.918772 -0.092328 -1.001984
C  -2.831258 0.588393 -0.028172
C  -2.524936 1.860089 0.442961
C  -3.982637 -0.056102 0.412756
C  -3.38572 2.49061 1.333483
C  -4.827372 0.57606 1.311959
C  -4.539991 1.852907 1.768708
C  -2.484905 4.695027 1.166882
C  -2.726507 4.931941 -0.181266
C  -1.614913 5.506829 1.882548
C  -2.074589 5.98299 -0.810804
C  -0.981526 6.562133 1.242859
C  -1.202204 6.801643 -0.106419
H  2.016752 -3.017672 -1.699766
H  0.746965 -2.085159 0.964087
H  1.462101 -4.119382 1.954925
H  0.025965 -5.043698 1.546304
H  1.612824 -5.619332 1.041116
H  0.566769 -5.756351 -1.307562
H  -0.937823 -4.965562 -0.846473
H  0.054414 -4.300044 -2.143815
H  3.162089 -2.846204 1.189571
H  -1.333988 0.635792 -1.568224
H  -2.495376 -0.690637 -1.709614
H  -1.619136 2.35108 0.107221
H  -4.22209 -1.046745 0.045891
H  -5.726591 0.079227 1.652204
H  -5.203373 2.355723 2.461357
H  -3.416318 4.311726 -0.739753
H  -1.443454 5.314899 2.934584
H  -2.25985 6.16519 -1.861635
H  -0.307284 7.195722 1.804716
H  -0.701454 7.621372 -0.604495
elementType: Cl O C H
totalener: -1958.45076461 hartree
nucrepener: 2374.63727813 hartree
electener: -4333.08804274 hartree
oneelecener: -7402.70237425 hartree
twoeener: 3069.61433152 hartree
cpcmener: -0.02577105 hartree
kineticenergy: 1952.55698788 hartree
xcener: -143.502959873759 hartree
chargesum: 0.0000000
charge: -0.056646 -0.061489 -0.275000 -0.469795 -0.325831 0.083562 0.034002 -0.079370 -0.261977 -0.266208 -0.205318 0.399808 0.043447 0.078843 -0.024974 -0.185518 -0.209176 0.280725 -0.121541 -0.241761 0.308205 -0.213311 -0.258538 -0.138016 -0.114866 -0.191135 0.076295 0.095046 0.090292 0.097675 0.100465 0.097489 0.098850 0.093685 0.129252 0.116853 0.111738 0.141466 0.144543 0.157612 0.145965 0.156551 0.144883 0.158813 0.157134 0.157270
qa: -0.0566 -0.0615 -0.2750 -0.4698 -0.3258 0.0836 0.0340 -0.0794 -0.2620 -0.2662 -0.2053 0.3998 0.0434 0.0788 -0.0250 -0.1855 -0.2092 0.2807 -0.1215 -0.2418 0.3082 -0.2133 -0.2585 -0.1380 -0.1149 -0.1911 0.0763 0.0950 0.0903 0.0977 0.1005 0.0975 0.0989 0.0937 0.1293 0.1169 0.1117 0.1415 0.1445 0.1576 0.1460 0.1566 0.1449 0.1588 0.1571 0.1573
va: 1.2688 1.2436 2.1317 2.0363 2.0846 3.7439 3.8458 3.8687 3.9082 3.9046 3.9046 4.1712 4.2092 3.8017 3.7555 3.9127 3.9436 3.7274 3.9000 4.0075 3.6733 3.9193 4.0122 3.8874 3.8802 3.9116 1.0532 1.0324 1.0055 1.0018 1.0010 1.0005 0.9997 1.0196 1.0185 0.9987 0.9999 1.0085 1.0013 0.9894 1.0074 0.9971 1.0091 0.9903 0.9893 0.9909
dispcorr: -0.020383110 hartree
energy: -1958.471147719634
dipole: -33.17788 32.09975 -1.07813 4.22978 -4.32330 -0.09353 5.21938 -4.37103 0.84836
magnitude: 1.37507 au
magnitude: 3.49516 debye
