program: Gaussian 09
title: 000074914
version: EM64L-G09RevD.01
frameworkgroup: C1[X(C12H22O4)]
method: RPBEPBE
basis: SDD
operation: Freq
keyword: #pfreq=noraman
keyword: PBEPBE/SDD
title: #p freq=noraman PBEPBE/SDD
converged: YES YES NO NO
title: Mulliken charges:
elementType: O O O O C C C C C C C C C C C C H H H H H H H H H H H H H H H H H H H H H H
charge: -0.233196 -0.233208 -0.194446 -0.194459 -0.037132 -0.037116 -0.410395 -0.410444 -0.286450 -0.286424 -0.709810 -0.709316 -0.709865 -0.709263 0.152207 0.152197 0.209637 0.209637 0.222491 0.218914 0.222471 0.218979 0.244058 0.246864 0.244031 0.246871 0.216766 0.216483 0.209912 0.217803 0.209315 0.216302 0.216774 0.216487 0.209931 0.217796 0.209302 0.216295
chargesum: 0.00000
title: Mulliken charges with hydrogens summed into heavy atoms:
elementType: O O O O C C C C C C C C C C C C
charge: -0.233196 -0.233208 -0.194446 -0.194459 0.172505 0.172521 0.031011 0.031006 0.204471 0.204479 -0.066648 -0.065896 -0.066674 -0.065870 0.152207 0.152197
polarizability: 1.92391802e+02 -2.23400435e+00 1.29424253e+02 -3.90567911e-04 9.17334413e-02 1.17072975e+02
1716.lowfreq: -0.0009 -0.0006 0.0001 4.5994 7.1661 13.8864 16.3751 26.1490 33.4328
frequency: 16.0278 25.9887 32.2034 40.4888 45.7351 50.6232 98.0541 100.0802 102.1607 124.7711 154.9313 164.5495 192.4550 220.2189 221.1641 236.4123 237.4824 293.4683 295.9421 314.1648 352.2800 357.6280 358.4757 380.8722 399.6287 440.3809 534.4310 539.8535 595.6409 724.5231 761.1819 774.5283 776.4572 779.8208 799.8225 846.6064 873.3976 914.6786 915.3264 929.4872 952.5414 952.6349 967.2919 969.6313 986.5234 986.9473 1021.8695 1023.6085 1101.4108 1140.0167 1141.2328 1148.0139 1148.3159 1192.9851 1193.7948 1210.4065 1212.8474 1216.9368 1283.7520 1284.2606 1288.2812 1288.9862 1334.7473 1335.0016 1337.3206 1339.2580 1380.9585 1382.1009 1382.3132 1383.7488 1401.7317 1401.9365 1461.6785 1462.2947 1465.9524 1466.0205 1479.3447 1479.5472 1479.6292 1479.9097 1486.4990 1486.6407 1491.5890 1491.8497 1623.2670 1634.1689 2970.7672 2971.0652 2971.4021 2971.4242 2974.5935 2974.6942 2995.7174 2995.7658 3014.0623 3014.2795 3046.3723 3046.5465 3062.6629 3062.7381 3069.6499 3069.7201 3070.6145 3070.6679 3073.8633 3073.9999 3087.0129 3087.2287
redmass: 6.0570 2.8699 4.4340 4.9247 4.1239 3.9515 4.5396 1.8833 1.8779 3.4158 4.1596 4.2318 3.5599 1.1309 1.1706 1.0424 1.0417 4.4020 4.1111 5.4464 2.4816 2.0951 2.0865 2.3561 3.9812 8.5358 3.7914 2.5711 4.9497 8.2063 6.0584 1.1783 1.2524 3.6307 3.1802 6.5884 6.7498 1.2030 1.2027 6.6089 1.2705 1.2685 2.0033 2.0453 1.7683 1.7644 1.8458 1.9546 10.6152 2.0094 2.0088 1.7980 1.8005 1.9932 1.9348 1.6108 1.2028 2.7287 1.1212 1.1196 1.5265 1.5513 1.4569 1.4575 1.3287 1.3368 1.4125 1.2202 1.2272 1.4422 1.2245 1.2251 1.0889 1.0892 1.0448 1.0448 1.0784 1.0560 1.0600 1.0821 1.0513 1.0512 1.0517 1.0517 11.6161 12.1382 1.0780 1.0544 1.0419 1.0567 1.0365 1.0363 1.0638 1.0636 1.0564 1.0565 1.1023 1.1023 1.0998 1.0998 1.1002 1.1002 1.0985 1.0985 1.0989 1.0988 1.1079 1.1079
irintensity: 1.4668 0.2929 0.2738 0.1653 0.9228 0.5328 0.0028 0.4446 0.7992 2.4389 1.0496 1.6885 0.0778 0.0972 0.0155 0.1046 0.0913 0.2131 13.6085 30.1923 0.1690 0.0667 0.0508 1.4385 0.0445 8.7431 10.3124 12.8841 4.8349 14.9553 0.2802 4.5281 0.8608 0.0670 4.8481 0.4150 44.2124 2.6478 2.4784 0.9902 0.0917 0.0753 1.7678 0.1099 0.0454 0.0393 3.5936 0.4928 913.7263 0.0754 1.9941 11.8367 0.6290 0.1584 11.2505 5.0852 0.2801 8.1342 0.7547 0.6806 19.4438 0.7037 1.7131 1.8401 7.7665 0.1488 10.0994 35.6812 9.5588 2.1147 17.4865 10.5809 8.0908 3.8089 0.7166 1.3385 18.9639 3.7791 4.4406 4.1930 23.1953 4.3911 21.8890 15.1926 362.4017 19.2292 17.1977 25.9030 27.6893 36.9896 18.7830 18.2430 28.5393 17.7231 18.0174 17.5351 4.6364 4.8215 18.2968 22.4393 8.8527 12.8396 105.4360 63.6287 165.9584 1.2994 16.9722 61.5540
temp: 298.150 k
press: 1.00000 atm
elementType: 8 8 8 8 6 6 6 6 6 6 6 6 6 6 6 6 1 1 1 1 1 1 1 1 1 1 1 1 1 1 1 1 1 1 1 1 1 1
symmnumber: 1
zpe: 849806.7 jmol-1
zpe.correction: 0.323674 hartree
zpe.thermalcorrener: 0.343795 hartree
zpe.thermalcorrenthalpy: 0.344739 hartree
zpe.thermalcorrgfe: 0.271574 hartree
zpe.sumelectzpe: -770.063260 hartree
zpe.sumelectthermal: -770.043140 hartree
zpe.sumelectthermalent: -770.042195 hartree
zpe.sumelectthermalfe: -770.115361 hartree
dipole: 0.0001 -0.0079 0.8756
dipole: 0.8756
quadrupole: -68.8868 -108.6541 -96.9291
quadrupole: -1.6814 -0.0119 -0.0936
quadrupole: 22.6032 -17.1641 -5.4391 -1.6814 -0.0119 -0.0936
hfenergy: -770.3869347 hartree
pointgroup: C01 [X(C12H22O4)]
dipole: -0.0000411 -0.0002043 -0.3444941 debye
polarizability: 192.4399948|1.3976815|129.3767278|0.020229|0.0122779|117.0723077 unknown
InChI: InChI=1S/C12H22O4/c1-9(2)5-7-15-11(13)12(14)16-8-6-10(3)4/h9-10H,5-8H2,1-4H3
charge 0 multiplicity 1
38 atoms
O  1.722974 0.408053 0.083897
O  -1.722943 -0.406846 0.081902
O  0.717426 -1.64177 0.578763
O  -0.717936 1.642662 0.579216
C  5.566954 0.370411 -0.189282
C  -5.567159 -0.370759 -0.188179
C  4.088114 0.856388 -0.178088
C  -4.088194 -0.856363 -0.176951
C  3.070938 -0.251101 0.100056
C  -3.071056 0.252092 0.097466
C  5.845648 -0.654197 -1.31711
C  6.020075 -0.179016 1.186348
C  -5.846767 0.651645 -1.317787
C  -6.019639 0.181078 1.186682
C  0.647452 -0.415852 0.349201
C  -0.647726 0.41691 0.348832
H  6.177255 1.272463 -0.40304
H  -6.177363 -1.273358 -0.399899
H  3.965893 1.64391 0.589977
H  3.846165 1.318303 -1.154563
H  -3.965151 -1.641845 0.59307
H  -3.846951 -1.320778 -1.152413
H  3.070663 -1.043176 -0.669748
H  3.203375 -0.723751 1.089382
H  -3.071487 1.041935 -0.674627
H  -3.202854 0.727526 1.085532
H  5.511782 -0.271659 -2.299887
H  6.927303 -0.871519 -1.387666
H  5.329433 -1.615087 -1.131859
H  5.806899 0.542047 1.997565
H  5.511769 -1.130138 1.433709
H  7.107428 -0.378786 1.187093
H  -5.51322 0.267382 -2.300001
H  -6.928534 0.868432 -1.388239
H  -5.330822 1.613069 -1.134586
H  -5.806077 -0.53857 1.999051
H  -5.511267 1.132647 1.432205
H  -7.107001 0.380817 1.187578
