program: Orca
programVersion: 5.0.3
elementType: Cl Cl O O O C C C C C C C C C C C C C C C C C C C C C H H H H H H H H H H H H H H H H H H H H
charge: 0
multiplicity: 1
keywords: wb97x-d3
keywords: def2-TZVPP
keywords: def2/J RIJCOSX
keywords: DEFGRID2
keywords: scfconv7
keywords: smallprint printgap noloewdin
keywords: NOSOSCF
formula: C21H20Cl2O3
InChI: InChI=1/C21H20Cl2O3/c1-21(2)17(12-18(22)23)19(21)20(24)25-13-14-7-6-10-16(11-14)26-15-8-4-3-5-9-15/h3-12,17,19H,13H2,1-2H3
46 atoms
Cl 5.235333 -2.986194 -0.736465
Cl 5.173258 -4.146023 1.904044
O  -0.629514 -0.828348 -0.237898
O  0.617365 -1.095484 -2.068101
O  -3.24805 4.190167 1.505177
C  0.883638 -4.034839 -1.045129
C  2.09183 -3.25418 -0.614348
C  0.701121 -2.722083 -0.311522
C  0.478332 -5.27481 -0.283876
C  0.614733 -4.14773 -2.526313
C  2.939686 -3.68158 0.503811
C  0.249201 -1.487819 -0.986742
C  4.264367 -3.608586 0.54193
C  -1.172589 0.381232 -0.77239
C  -2.170121 0.930713 0.204349
C  -2.217073 2.305128 0.404258
C  -3.077439 0.105675 0.864214
C  -3.182059 2.852101 1.242155
C  -4.017577 0.662087 1.717914
C  -4.084199 2.034741 1.906456
C  -2.986479 5.109283 0.526213
C  -3.454723 4.964258 -0.774827
C  -2.28013 6.243812 0.901177
C  -3.196072 5.963522 -1.702106
C  -2.040325 7.240547 -0.033916
C  -2.489607 7.103237 -1.340158
H  2.601347 -2.740792 -1.421885
H  0.369302 -2.819409 0.716186
H  1.079724 -6.130074 -0.598016
H  0.580822 -5.172834 0.79579
H  -0.566949 -5.514096 -0.487534
H  1.059221 -5.071485 -2.902973
H  -0.458058 -4.194838 -2.726626
H  1.031523 -3.327038 -3.105757
H  2.452382 -4.089601 1.381427
H  -0.376741 1.10632 -0.955936
H  -1.660118 0.175698 -1.729669
H  -1.49539 2.942829 -0.093397
H  -3.059245 -0.966625 0.717193
H  -4.720608 0.021483 2.234771
H  -4.825851 2.468339 2.565611
H  -4.019217 4.087819 -1.06859
H  -1.926738 6.346028 1.919965
H  -3.55893 5.849348 -2.715674
H  -1.49076 8.124762 0.262958
H  -2.295462 7.879061 -2.069068
elementType: Cl O C H
totalener: -1958.45030167 hartree
nucrepener: 2356.33960929 hartree
electener: -4314.78991096 hartree
oneelecener: -7366.00265174 hartree
twoeener: 3051.21274078 hartree
cpcmener: -0.02540956 hartree
kineticenergy: 1952.54324547 hartree
xcener: -143.502468956238 hartree
chargesum: 0.0000000
charge: -0.056015 -0.061212 -0.281108 -0.468591 -0.327849 0.087797 0.029647 -0.062018 -0.265691 -0.268933 -0.200350 0.394802 0.040788 0.101319 0.026960 -0.208419 -0.241249 0.267928 -0.122880 -0.242908 0.283734 -0.193725 -0.250572 -0.142397 -0.119506 -0.187406 0.078252 0.094479 0.100741 0.090389 0.098173 0.095771 0.099375 0.095668 0.128291 0.108794 0.114802 0.142736 0.141173 0.156536 0.146021 0.156548 0.145683 0.159128 0.157799 0.157500
qa: -0.0560 -0.0612 -0.2811 -0.4686 -0.3278 0.0878 0.0296 -0.0620 -0.2657 -0.2689 -0.2004 0.3948 0.0408 0.1013 0.0270 -0.2084 -0.2412 0.2679 -0.1229 -0.2429 0.2837 -0.1937 -0.2506 -0.1424 -0.1195 -0.1874 0.0783 0.0945 0.1007 0.0904 0.0982 0.0958 0.0994 0.0957 0.1283 0.1088 0.1148 0.1427 0.1412 0.1565 0.1460 0.1565 0.1457 0.1591 0.1578 0.1575
va: 1.2696 1.2436 2.1430 2.0409 2.0766 3.7234 3.8709 3.8577 3.9117 3.9018 3.8989 4.1579 4.2110 3.7937 3.7249 3.9429 3.9643 3.7440 3.9092 4.0114 3.6948 3.9109 4.0088 3.8903 3.8827 3.9075 1.0484 1.0313 1.0010 1.0059 1.0012 1.0003 0.9992 1.0202 1.0190 1.0050 0.9943 1.0076 1.0144 0.9902 1.0069 0.9968 1.0084 0.9902 0.9891 0.9908
dispcorr: -0.020429766 hartree
energy: -1958.470731439422
dipole: -34.20514 32.81511 -1.39003 8.85986 -9.35477 -0.49491 -10.29723 10.37774 0.08052
magnitude: 1.47770 au
magnitude: 3.75601 debye
