program: Orca
programVersion: 5.0.3
elementType: Cl Cl O O O C C C C C C C C C C C C C C C C C C C C C H H H H H H H H H H H H H H H H H H H H
charge: 0
multiplicity: 1
keywords: wb97x-d3
keywords: def2-TZVPP
keywords: def2/J RIJCOSX
keywords: DEFGRID2
keywords: scfconv7
keywords: smallprint printgap noloewdin
keywords: NOSOSCF
formula: C21H20Cl2O3
InChI: InChI=1/C21H20Cl2O3/c1-21(2)17(12-18(22)23)19(21)20(24)25-13-14-7-6-10-16(11-14)26-15-8-4-3-5-9-15/h3-12,17,19H,13H2,1-2H3
46 atoms
Cl 4.451082 -2.379054 1.420073
Cl 4.5666 -4.883233 -0.009889
O  -1.70899 -1.715702 0.242057
O  -0.23401 -0.20346 0.979836
O  -3.321417 3.672754 0.227233
C  1.37029 -1.07393 -1.547952
C  1.909543 -1.808693 -0.353572
C  0.420001 -1.834206 -0.646438
C  1.56753 -1.646351 -2.931643
C  1.417592 0.435546 -1.525087
C  2.667666 -3.057769 -0.487664
C  -0.506993 -1.147338 0.27737
C  3.743707 -3.386621 0.216337
C  -2.762652 -1.140831 1.03183
C  -3.3928 0.011702 0.305541
C  -3.062925 1.318697 0.637803
C  -4.287012 -0.230645 -0.73543
C  -3.609201 2.371953 -0.084946
C  -4.842428 0.828566 -1.435201
C  -4.498074 2.136416 -1.122499
C  -2.018626 4.035643 0.438716
C  -0.96737 3.49366 -0.292845
C  -1.784146 5.016751 1.392806
C  0.324249 3.941565 -0.0564
C  -0.487717 5.459533 1.612455
C  0.572484 4.92212 0.894888
H  2.195377 -1.171331 0.47539
H  0.03233 -2.756042 -1.06529
H  1.406645 -2.72278 -2.97988
H  0.868649 -1.183953 -3.631021
H  2.577817 -1.44145 -3.290992
H  2.295099 0.778366 -2.076733
H  0.538044 0.860369 -2.013427
H  1.483953 0.848173 -0.521373
H  2.324206 -3.782629 -1.216251
H  -3.477389 -1.951088 1.16746
H  -2.393566 -0.846743 2.014801
H  -2.380701 1.514225 1.456278
H  -4.554465 -1.24893 -0.991043
H  -5.5431 0.63917 -2.2384
H  -4.919411 2.967626 -1.674153
H  -1.145391 2.735632 -1.045449
H  -2.612375 5.430059 1.955517
H  1.141386 3.521004 -0.629275
H  -0.308924 6.224558 2.357257
H  1.583162 5.265026 1.073079
elementType: Cl O C H
totalener: -1958.44957749 hartree
nucrepener: 2508.62405087 hartree
electener: -4467.07362836 hartree
oneelecener: -7671.17782122 hartree
twoeener: 3204.10419286 hartree
cpcmener: -0.02542654 hartree
kineticenergy: 1952.56166076 hartree
xcener: -143.504937525347 hartree
chargesum: -0.0000000
charge: -0.056548 -0.061029 -0.282114 -0.467042 -0.333174 0.111430 0.023047 -0.080479 -0.268936 -0.298720 -0.201247 0.408620 0.040220 0.081789 -0.026656 -0.139764 -0.215880 0.232269 -0.126540 -0.227127 0.283018 -0.193283 -0.244888 -0.151705 -0.122544 -0.189594 0.081154 0.093219 0.090759 0.099108 0.101300 0.100577 0.105551 0.092521 0.128206 0.125398 0.115541 0.142293 0.142954 0.158024 0.147068 0.157254 0.145081 0.167102 0.156742 0.157026
qa: -0.0565 -0.0610 -0.2821 -0.4670 -0.3332 0.1114 0.0230 -0.0805 -0.2689 -0.2987 -0.2012 0.4086 0.0402 0.0818 -0.0267 -0.1398 -0.2159 0.2323 -0.1265 -0.2271 0.2830 -0.1933 -0.2449 -0.1517 -0.1225 -0.1896 0.0812 0.0932 0.0908 0.0991 0.1013 0.1006 0.1056 0.0925 0.1282 0.1254 0.1155 0.1423 0.1430 0.1580 0.1471 0.1573 0.1451 0.1671 0.1567 0.1570
va: 1.2690 1.2440 2.1334 2.0383 2.0745 3.6962 3.8708 3.8486 3.9103 3.9095 3.8958 4.1763 4.2126 3.8112 3.6488 3.8746 3.9692 3.7629 3.8930 4.0144 3.7120 3.8842 4.0021 3.8858 3.8948 3.9260 1.0459 1.0341 1.0062 1.0008 1.0006 1.0020 0.9938 1.0144 1.0189 0.9941 1.0112 1.0211 1.0033 0.9887 1.0050 0.9946 1.0082 0.9850 0.9887 0.9915
dispcorr: -0.023793465 hartree
energy: -1958.473370953181
dipole: -22.62685 21.81013 -0.81672 22.26380 -22.85862 -0.59482 -14.24610 12.98633 -1.25977
magnitude: 1.61489 au
magnitude: 4.10471 debye
