program: Orca
programVersion: 5.0.3
elementType: Cl Cl O O O C C C C C C C C C C C C C C C C C C C C C H H H H H H H H H H H H H H H H H H H H
charge: 0
multiplicity: 1
keywords: wb97x-d3
keywords: def2-TZVPP
keywords: def2/J RIJCOSX
keywords: DEFGRID2
keywords: scfconv7
keywords: smallprint printgap noloewdin
keywords: NOSOSCF
formula: C21H20Cl2O3
InChI: InChI=1/C21H20Cl2O3/c1-21(2)17(12-18(22)23)19(21)20(24)25-13-14-7-6-10-16(11-14)26-15-8-4-3-5-9-15/h3-12,17,19H,13H2,1-2H3
46 atoms
Cl 2.630048 0.525187 -1.118122
Cl 3.882604 0.654661 1.477232
O  -1.362317 -2.191148 -1.020952
O  -2.166159 -2.98769 0.9025
O  -1.667625 2.443148 1.013812
C  1.269044 -3.609525 -0.10174
C  1.306912 -2.108656 -0.049485
C  0.178575 -2.85975 0.633525
C  2.210635 -4.413763 0.761644
C  0.995812 -4.259027 -1.436371
C  2.243742 -1.347294 0.78419
C  -1.226673 -2.70782 0.198219
C  2.832192 -0.213329 0.422459
C  -2.657937 -1.73556 -1.403792
C  -3.078767 -0.5286 -0.60862
C  -2.140277 0.419786 -0.212365
C  -4.417857 -0.354112 -0.279905
C  -2.551383 1.528815 0.515357
C  -4.817015 0.766588 0.433661
C  -3.889607 1.71469 0.834523
C  -0.607411 2.892897 0.277755
C  -0.681776 3.11269 -1.092315
C  0.549538 3.202569 0.981562
C  0.415097 3.651589 -1.750793
C  1.631735 3.751755 0.311293
C  1.571393 3.977795 -1.056624
H  1.034319 -1.6305 -0.98197
H  0.244442 -2.937274 1.713404
H  1.832422 -5.429724 0.888492
H  3.194384 -4.482981 0.293336
H  2.343627 -3.991177 1.757182
H  0.480226 -5.21204 -1.303049
H  0.396424 -3.64313 -2.103434
H  1.939575 -4.465241 -1.944806
H  2.453248 -1.711598 1.78299
H  -2.558339 -1.483857 -2.460184
H  -3.397994 -2.534164 -1.323002
H  -1.091102 0.293528 -0.453734
H  -5.147994 -1.098511 -0.572543
H  -5.86007 0.899563 0.689901
H  -4.194433 2.583826 1.403745
H  -1.583483 2.88104 -1.645259
H  0.593377 3.026233 2.049184
H  0.355216 3.824836 -2.817688
H  2.529183 3.996625 0.864498
H  2.419824 4.400796 -1.578215
elementType: Cl O C H
totalener: -1958.44631661 hartree
nucrepener: 2661.70611551 hartree
electener: -4620.15243212 hartree
oneelecener: -7977.38836717 hartree
twoeener: 3357.23593505 hartree
cpcmener: -0.02708498 hartree
kineticenergy: 1952.56572181 hartree
xcener: -143.510084429760 hartree
chargesum: 0.0000000
charge: -0.058278 -0.066038 -0.287619 -0.447626 -0.328519 0.083879 0.044209 -0.068854 -0.269161 -0.260663 -0.219788 0.376781 0.063172 0.075709 0.038125 -0.210011 -0.236602 0.291723 -0.102530 -0.264354 0.315988 -0.202454 -0.263254 -0.138044 -0.122980 -0.192794 0.080842 0.096542 0.098750 0.100631 0.089776 0.099445 0.093056 0.096111 0.129707 0.116812 0.117976 0.129328 0.139895 0.156903 0.145741 0.152550 0.143128 0.157802 0.150729 0.154259
qa: -0.0583 -0.0660 -0.2876 -0.4476 -0.3285 0.0839 0.0442 -0.0689 -0.2692 -0.2607 -0.2198 0.3768 0.0632 0.0757 0.0381 -0.2100 -0.2366 0.2917 -0.1025 -0.2644 0.3160 -0.2025 -0.2633 -0.1380 -0.1230 -0.1928 0.0808 0.0965 0.0987 0.1006 0.0898 0.0994 0.0931 0.0961 0.1297 0.1168 0.1180 0.1293 0.1399 0.1569 0.1457 0.1525 0.1431 0.1578 0.1507 0.1543
va: 1.2686 1.2380 2.0988 2.0583 2.0791 3.7708 3.7962 3.8092 3.9132 3.9029 3.9160 4.2028 4.1810 3.8151 3.6327 3.9455 3.9821 3.7059 3.8808 4.0181 3.6553 3.9037 3.9637 3.8729 3.8428 3.8754 1.0453 1.0299 1.0015 1.0006 1.0052 1.0004 1.0150 1.0002 1.0192 0.9938 1.0067 1.0121 1.0030 0.9888 1.0072 0.9990 1.0099 0.9896 0.9954 0.9916
dispcorr: -0.026606150 hartree
energy: -1958.472922759457
dipole: -13.13185 13.49651 0.36465 -16.96678 16.19986 -0.76692 -5.82181 4.64991 -1.17190
magnitude: 1.44723 au
magnitude: 3.67857 debye
