program: Gaussian 09
title: 000074870
version: EM64L-G09RevD.01
frameworkgroup: C1[X(C8H7Br)]
method: RPBEPBE
basis: SDD
operation: Freq
keyword: #pfreq=noraman
keyword: PBEPBE/SDD
title: #p freq=noraman PBEPBE/SDD
converged: YES YES NO NO
title: Mulliken charges:
elementType: Br C C C C C C C C H H H H H H H
charge: 0.000436 0.475152 -0.334820 -0.381065 -0.198519 -0.214096 -0.208782 -0.191193 -0.564179 0.250110 0.229218 0.233477 0.253710 0.218099 0.219347 0.213106
chargesum: 0.00000
title: Mulliken charges with hydrogens summed into heavy atoms:
elementType: Br C C C C C C C C
charge: 0.000436 0.475152 -0.084710 -0.151848 -0.198519 0.019381 0.044928 0.026906 -0.131726
polarizability: 1.72586953e+02 -4.58355643e+00 1.01045080e+02 4.05793163e-02 3.08286728e-02 3.71631456e+01
1716.lowfreq: -10.6538 -4.1937 -0.0004 -0.0004 0.0003 6.3380 72.0869 153.7224 160.9866
frequency: 72.0076 153.7218 160.9863 209.2265 266.2259 292.6926 427.1336 448.4706 485.9945 560.6423 653.2131 654.1160 719.6992 798.4189 804.6098 897.3965 908.9130 939.4853 980.6842 982.3849 1010.6944 1027.1987 1067.5318 1104.0898 1182.9125 1213.2979 1289.0265 1317.7060 1371.5703 1403.2899 1440.2629 1468.4580 1561.1936 1602.1324 1646.6444 3093.3629 3106.1024 3137.2094 3150.0011 3157.7863 3177.2321 3206.4811
redmass: 2.6696 5.4510 4.3102 2.3031 4.5030 6.4777 2.7338 4.9688 2.7685 3.1252 6.6865 2.4589 1.5192 1.5298 4.7570 1.4723 1.4918 1.3377 5.7998 1.3546 1.1628 1.5969 2.2135 1.5368 1.0941 2.1300 1.4384 1.2647 4.9721 2.6825 1.3152 2.4008 5.8566 6.4293 4.3602 1.0763 1.0761 1.0865 1.0924 1.0939 1.0975 1.1140
irintensity: 0.0046 0.2211 0.9411 2.5331 0.4534 3.6436 7.4049 0.3306 0.0723 4.0748 21.9399 17.4069 17.1685 40.7301 40.6920 17.2540 0.6586 84.0400 9.8931 0.3676 22.9633 9.2530 24.5028 1.4299 0.1274 23.8896 2.7677 0.3698 7.8931 12.6701 0.5556 37.3200 74.7501 18.3762 8.4913 17.5395 5.0344 5.2676 5.5038 10.8521 7.2597 20.7469
temp: 298.150 k
press: 1.00000 atm
elementType: 35 6 6 6 6 6 6 6 6 1 1 1 1 1 1 1
symmnumber: 1
zpe: 317908.8 jmol-1
zpe.correction: 0.121085 hartree
zpe.thermalcorrener: 0.129348 hartree
zpe.thermalcorrenthalpy: 0.130293 hartree
zpe.thermalcorrgfe: 0.086623 hartree
zpe.sumelectzpe: -321.853900 hartree
zpe.sumelectthermal: -321.845636 hartree
zpe.sumelectthermalent: -321.844692 hartree
zpe.sumelectthermalfe: -321.888361 hartree
dipole: 2.0226 0.6916 -0.0023
dipole: 2.1376
quadrupole: -57.5923 -53.6781 -67.8562
quadrupole: -0.4442 0.0095 0.0106
quadrupole: 2.1166 6.0308 -8.1474 -0.4442 0.0095 0.0106
hfenergy: -321.9749848 hartree
pointgroup: C01 [X(C8H7Br1)]
dipole: 0.7126527 0.442922 -0.0567477 debye
dipolederiv: -0.5823671 -0.2781615 0.0379866 -0.3284077 -0.2576088 0.026152 0.0413636 0.0242964 -0.0512147 0.2666444 -0.0563991 -0.0021307 0.0501528 0.0243406 0.0014681 -0.008582 0.0047903 0.073728 -0.4947957 -0.0953847 0.0185086 -0.1834423 -0.0404481 -0.0007222 0.0254408 -0.0037834 -0.1369572 -0.1043103 0.0718806 -0.0079243 0.1280323 -0.0856703 -0.0100864 -0.0124136 -0.0080593 -0.1605799 1.0894679 0.5390442 -0.0786046 0.6447092 0.4047836 -0.0581612 -0.0865118 -0.054576 -0.0954108 0.0599319 0.0561486 -0.0104852 -0.088926 0.1314022 -0.0167264 0.0003218 -0.0214634 -0.1295678 -0.3108759 -0.2237173 0.0226371 -0.1239451 -0.206577 0.0103598 0.0154766 0.0134334 -0.1221559 0.1828714 -0.0250177 -0.0084507 -0.2496671 0.1994564 -0.0158555 0.0059034 -0.0230697 -0.1440902 -0.2899718 -0.0022025 -0.0028932 0.0081033 0.0824873 -0.0325101 -0.0029551 -0.0323949 -0.393844 0.1025884 0.0290379 -0.0000768 0.0202048 -0.0513587 0.0147691 0.0004926 0.0144012 0.1599452 -0.0458642 -0.1039548 0.014586 -0.06811 0.0442477 0.0102973 0.0119314 0.011465 0.150186 0.0563844 -0.0039238 0.0037244 0.0118924 -0.1144445 0.0198803 0.002691 0.0206026 0.157785 -0.0221374 0.0657707 0.0014258 0.0585496 0.0766917 0.0047957 0.0018173 0.0045822 0.1670936 0.042834 -0.0596932 0.0077764 0.0479349 -0.1193864 0.017379 0.0002995 0.0210574 0.1525918 -0.0609466 0.0793472 0.0022538 0.0974803 0.0253423 0.008077 0.000886 0.0087851 0.1881602 0.1105467 0.0072254 0.0016667 -0.0245615 -0.1132579 0.0208833 0.0038385 0.0199332 0.1843306 unknown
polarizability: 170.7782439|11.3754728|102.3129225|-5.1800775|-5.1128605|37.7040121 unknown
InChI: InChI=1S/C8H7Br/c1-2-7-4-3-5-8(9)6-7/h2-6H,1H2
charge 0 multiplicity 1
16 atoms
Br -3.221217 -1.372518 0.217253
C  0.871533 -0.2003 -0.003926
C  -0.331905 -0.956485 0.091101
C  0.775821 1.216354 -0.105231
C  -1.576013 -0.299866 0.084933
C  -0.48035 1.85255 -0.109773
C  -1.678256 1.101417 -0.014366
C  2.158327 -0.929914 0.006142
C  3.407007 -0.393514 -0.069269
H  -0.283643 -2.047744 0.16859
H  1.685462 1.82104 -0.18157
H  -0.542272 2.943292 -0.18866
H  -2.653582 1.595433 -0.018736
H  2.071994 -2.023565 0.084734
H  4.295482 -1.032755 -0.052777
H  3.586213 0.685074 -0.147344
