program: Orca
programVersion: 5.0.3
elementType: Cl Cl O O O C C C C C C C C C C C C C C C C C C C C C H H H H H H H H H H H H H H H H H H H H
charge: 0
multiplicity: 1
keywords: wb97x-d3
keywords: def2-TZVPP
keywords: def2/J RIJCOSX
keywords: DEFGRID2
keywords: scfconv7
keywords: smallprint printgap noloewdin
keywords: NOSOSCF
formula: C21H20Cl2O3
InChI: InChI=1/C21H20Cl2O3/c1-21(2)17(12-18(22)23)19(21)20(24)25-13-14-7-6-10-16(11-14)26-15-8-4-3-5-9-15/h3-12,17,19H,13H2,1-2H3
46 atoms
Cl 3.946618 -3.448304 1.248851
Cl 4.917478 -4.117765 -1.383558
O  -1.687966 -1.322221 -1.013102
O  -0.736545 -1.397502 1.014829
O  -2.774514 3.560003 -0.001907
C  1.630297 -0.152205 -0.686606
C  1.932467 -1.56738 -0.280504
C  0.616656 -1.246882 -0.95694
C  2.300623 0.447086 -1.898797
C  1.394674 0.856917 0.409493
C  2.915321 -2.381733 -1.003407
C  -0.641142 -1.33569 -0.186282
C  3.802653 -3.195141 -0.44747
C  -3.00603 -1.357412 -0.475469
C  -3.622291 0.012419 -0.378172
C  -2.855872 1.161328 -0.227465
C  -5.009987 0.114572 -0.418695
C  -3.482521 2.395796 -0.101205
C  -5.62121 1.352316 -0.302166
C  -4.863845 2.50195 -0.136356
C  -1.626423 3.619288 0.739607
C  -0.587173 4.384725 0.229264
C  -1.509961 3.005003 1.981195
C  0.573271 4.544378 0.97293
C  -0.338874 3.164021 2.707707
C  0.705806 3.932009 2.211237
H  1.860308 -1.75281 0.784875
H  0.523898 -1.529416 -1.999332
H  2.371259 -0.244827 -2.736703
H  1.739515 1.317292 -2.243602
H  3.310188 0.782124 -1.653787
H  1.022931 0.414002 1.330523
H  2.33304 1.361296 0.646596
H  0.684556 1.62018 0.085073
H  2.925709 -2.320999 -2.084777
H  -3.587177 -1.978089 -1.156946
H  -3.014824 -1.847676 0.499986
H  -1.774509 1.116748 -0.216397
H  -5.613536 -0.775381 -0.549454
H  -6.700115 1.425867 -0.338528
H  -5.336818 3.471347 -0.04419
H  -0.692143 4.858178 -0.738916
H  -2.321293 2.413718 2.38695
H  1.380855 5.144345 0.57378
H  -0.248413 2.6846 3.673989
H  1.614726 4.051605 2.785902
elementType: Cl O C H
totalener: -1958.45004320 hartree
nucrepener: 2537.30346823 hartree
electener: -4495.75351142 hartree
oneelecener: -7728.13468258 hartree
twoeener: 3232.38117115 hartree
cpcmener: -0.02529398 hartree
kineticenergy: 1952.57179727 hartree
xcener: -143.512189171390 hartree
chargesum: 0.0000000
charge: -0.056449 -0.061619 -0.281303 -0.449760 -0.328049 0.126242 0.028039 -0.077422 -0.272629 -0.282508 -0.205291 0.363887 0.040524 0.081187 0.022741 -0.190365 -0.220684 0.251595 -0.114841 -0.246792 0.260373 -0.212618 -0.175762 -0.138187 -0.154085 -0.176581 0.077511 0.095349 0.091869 0.099746 0.101818 0.103867 0.109851 0.060792 0.128286 0.120389 0.114139 0.159629 0.138589 0.156678 0.144705 0.143800 0.154072 0.155788 0.157750 0.155727
qa: -0.0564 -0.0616 -0.2813 -0.4498 -0.3280 0.1262 0.0280 -0.0774 -0.2726 -0.2825 -0.2053 0.3639 0.0405 0.0812 0.0227 -0.1904 -0.2207 0.2516 -0.1148 -0.2468 0.2604 -0.2126 -0.1758 -0.1382 -0.1541 -0.1766 0.0775 0.0953 0.0919 0.0997 0.1018 0.1039 0.1099 0.0608 0.1283 0.1204 0.1141 0.1596 0.1386 0.1567 0.1447 0.1438 0.1541 0.1558 0.1577 0.1557
va: 1.2695 1.2431 2.1235 2.0532 2.0802 3.7225 3.8818 3.8428 3.9058 3.8957 3.9005 4.2417 4.2102 3.8416 3.6792 3.9322 3.9573 3.7794 3.8960 4.0029 3.7059 3.9505 3.8780 3.8717 3.8494 3.8509 1.0516 1.0338 1.0059 1.0002 1.0009 1.0146 1.0015 1.0105 1.0188 0.9945 1.0126 0.9677 1.0031 0.9893 1.0076 1.0082 0.9976 0.9903 0.9917 0.9919
dispcorr: -0.025284862 hartree
energy: -1958.475328057259
dipole: -21.47486 20.89491 -0.57995 28.76490 -28.25622 0.50868 -1.38146 0.37560 -1.00586
magnitude: 1.26762 au
magnitude: 3.22203 debye
