program: Orca
programVersion: 5.0.3
elementType: Cl Cl O O O C C C C C C C C C C C C C C C C C C C C C H H H H H H H H H H H H H H H H H H H H
charge: 0
multiplicity: 1
keywords: wb97x-d3
keywords: def2-TZVPP
keywords: def2/J RIJCOSX
keywords: DEFGRID2
keywords: scfconv7
keywords: smallprint printgap noloewdin
keywords: NOSOSCF
formula: C21H20Cl2O3
InChI: InChI=1/C21H20Cl2O3/c1-21(2)17(12-18(22)23)19(21)20(24)25-13-14-7-6-10-16(11-14)26-15-8-4-3-5-9-15/h3-12,17,19H,13H2,1-2H3
46 atoms
Cl 0.964183 -0.864534 1.87712
Cl 3.122884 -2.061518 3.385153
O  -1.789021 -2.513572 -0.670846
O  -0.354404 -1.377195 -1.952273
O  -2.312292 3.249128 -1.014803
C  1.558117 -3.810358 -1.294792
C  1.865022 -2.626276 -0.446715
C  0.438021 -3.127752 -0.525299
C  1.933913 -5.18184 -0.791046
C  1.651965 -3.674293 -2.793506
C  2.588701 -2.722915 0.839125
C  -0.571549 -2.248223 -1.144092
C  2.272688 -1.981237 1.890777
C  -2.839649 -1.598591 -1.003681
C  -2.662988 -0.296218 -0.274361
C  -2.551208 0.897552 -0.976269
C  -2.573068 -0.285483 1.114591
C  -2.37301 2.087954 -0.289083
C  -2.386192 0.91059 1.790723
C  -2.288096 2.106527 1.095844
C  -1.218397 4.057436 -0.875468
C  0.050778 3.559013 -0.603164
C  -1.416877 5.419423 -1.062294
C  1.118691 4.440559 -0.510996
C  -0.337948 6.286125 -0.973752
C  0.933412 5.803984 -0.692666
H  2.04053 -1.70059 -0.989291
H  0.080508 -3.681172 0.335749
H  2.973096 -5.409606 -1.036067
H  1.817288 -5.280248 0.28873
H  1.310003 -5.945036 -1.259002
H  1.460958 -2.662578 -3.143639
H  2.653928 -3.951442 -3.126318
H  0.944758 -4.342318 -3.288849
H  3.426495 -3.404303 0.927216
H  -2.903451 -1.448901 -2.082687
H  -3.75087 -2.102737 -0.682812
H  -2.597978 0.904196 -2.058756
H  -2.651502 -1.209686 1.673509
H  -2.322991 0.916366 2.871055
H  -2.15009 3.0402 1.627019
H  0.216572 2.497341 -0.467784
H  -2.409939 5.794797 -1.275844
H  2.1057 4.05018 -0.298718
H  -0.497663 7.347109 -1.117453
H  1.771629 6.483875 -0.617686
elementType: Cl O C H
totalener: -1958.44737828 hartree
nucrepener: 2577.93483584 hartree
electener: -4536.38221412 hartree
oneelecener: -7810.31599889 hartree
twoeener: 3273.93378477 hartree
cpcmener: -0.02460048 hartree
kineticenergy: 1952.58694846 hartree
xcener: -143.509015990548 hartree
chargesum: -0.0000000
charge: -0.055005 -0.058186 -0.282522 -0.464330 -0.332881 0.134501 -0.041447 -0.107122 -0.280002 -0.271628 -0.224109 0.374837 0.087682 0.097517 0.040051 -0.204470 -0.269264 0.222348 -0.130158 -0.164185 0.259727 -0.161033 -0.234376 -0.163399 -0.128741 -0.182418 0.112826 0.110059 0.101227 0.092707 0.098884 0.094102 0.094857 0.099162 0.139600 0.113671 0.126159 0.132098 0.141000 0.159892 0.158760 0.146983 0.144911 0.158092 0.156252 0.157370
qa: -0.0550 -0.0582 -0.2825 -0.4643 -0.3329 0.1345 -0.0414 -0.1071 -0.2800 -0.2716 -0.2241 0.3748 0.0877 0.0975 0.0401 -0.2045 -0.2693 0.2223 -0.1302 -0.1642 0.2597 -0.1610 -0.2344 -0.1634 -0.1287 -0.1824 0.1128 0.1101 0.1012 0.0927 0.0989 0.0941 0.0949 0.0992 0.1396 0.1137 0.1262 0.1321 0.1410 0.1599 0.1588 0.1470 0.1449 0.1581 0.1563 0.1574
va: 1.2925 1.2481 2.1152 2.0375 2.0607 3.7260 3.8701 3.8007 3.9118 3.8890 3.9122 4.1854 4.1779 3.7913 3.5748 4.0358 3.9215 3.7741 3.8314 3.9357 3.7094 3.8612 3.9905 3.9097 3.8994 3.8961 1.0249 1.0246 0.9995 0.9992 1.0031 1.0193 1.0013 0.9992 1.0084 1.0103 0.9923 1.0195 1.0131 0.9894 0.9938 1.0077 1.0084 0.9909 0.9894 0.9903
dispcorr: -0.024572500 hartree
energy: -1958.471950778138
dipole: -3.85536 4.16498 0.30961 -4.41199 3.03710 -1.37489 -20.98457 21.25049 0.26592
magnitude: 1.43419 au
magnitude: 3.64543 debye
