program: Orca
programVersion: 5.0.3
elementType: Cl Cl O O O C C C C C C C C C C C C C C C C C C C C C H H H H H H H H H H H H H H H H H H H H
charge: 0
multiplicity: 1
keywords: wb97x-d3
keywords: def2-TZVPP
keywords: def2/J RIJCOSX
keywords: DEFGRID2
keywords: scfconv7
keywords: smallprint printgap noloewdin
keywords: NOSOSCF
formula: C21H20Cl2O3
InChI: InChI=1/C21H20Cl2O3/c1-21(2)17(12-18(22)23)19(21)20(24)25-13-14-7-6-10-16(11-14)26-15-8-4-3-5-9-15/h3-12,17,19H,13H2,1-2H3
46 atoms
Cl 2.666141 -5.214465 -2.671334
Cl 5.32458 -4.326576 -1.987598
O  0.149241 0.488882 -1.037567
O  -0.790229 -1.446107 -1.648921
O  -2.803297 3.12492 2.574603
C  1.148735 -2.571153 0.544744
C  1.704258 -2.847342 -0.824331
C  1.283863 -1.43944 -0.454365
C  2.07675 -2.518993 1.73435
C  -0.203941 -3.148758 0.882716
C  3.131457 -3.118087 -1.037995
C  0.104471 -0.838569 -1.111708
C  3.628767 -4.08625 -1.797454
C  -0.959263 1.23841 -1.558675
C  -2.061932 1.338855 -0.543971
C  -1.912189 2.207175 0.532871
C  -3.213452 0.565957 -0.65018
C  -2.917964 2.309283 1.483489
C  -4.20536 0.665014 0.315022
C  -4.067302 1.53824 1.382537
C  -2.315577 4.394946 2.434264
C  -1.541316 4.89053 3.474508
C  -2.617285 5.191309 1.335358
C  -1.064955 6.192027 3.412348
C  -2.123782 6.486978 1.28225
C  -1.346684 6.99396 2.3150
H  1.021518 -3.3642 -1.489379
H  2.084791 -0.740265 -0.241332
H  3.01816 -2.012877 1.523576
H  1.599879 -1.985895 2.558939
H  2.309144 -3.526988 2.083591
H  -0.745287 -2.495372 1.570193
H  -0.831775 -3.317343 0.011169
H  -0.072072 -4.111812 1.379835
H  3.847629 -2.476816 -0.5377
H  -0.546176 2.222342 -1.777603
H  -1.315669 0.807102 -2.494681
H  -1.013321 2.807184 0.619503
H  -3.338397 -0.110405 -1.485619
H  -5.101086 0.063415 0.232379
H  -4.844083 1.623913 2.132133
H  -1.318023 4.261471 4.327136
H  -3.231691 4.815427 0.526813
H  -0.46249 6.575425 4.225786
H  -2.356466 7.105012 0.424524
H  -0.966488 8.005761 2.265743
elementType: Cl O C H
totalener: -1958.44989841 hartree
nucrepener: 2411.65195632 hartree
electener: -4370.10185474 hartree
oneelecener: -7476.97506710 hartree
twoeener: 3106.87321237 hartree
cpcmener: -0.02453349 hartree
kineticenergy: 1952.56650893 hartree
xcener: -143.505514952518 hartree
chargesum: 0.0000000
charge: -0.056191 -0.061234 -0.283588 -0.466624 -0.331693 0.089132 0.028661 -0.086752 -0.262587 -0.270393 -0.201940 0.406088 0.037883 0.085822 -0.011755 -0.196304 -0.175618 0.243114 -0.133927 -0.227801 0.279037 -0.246685 -0.183845 -0.123174 -0.150364 -0.186857 0.080417 0.095084 0.089522 0.098449 0.100553 0.100058 0.094581 0.096875 0.130186 0.124470 0.114353 0.142371 0.141335 0.157073 0.147080 0.145481 0.155416 0.157928 0.158834 0.157529
qa: -0.0562 -0.0612 -0.2836 -0.4666 -0.3317 0.0891 0.0287 -0.0868 -0.2626 -0.2704 -0.2019 0.4061 0.0379 0.0858 -0.0118 -0.1963 -0.1756 0.2431 -0.1339 -0.2278 0.2790 -0.2467 -0.1838 -0.1232 -0.1504 -0.1869 0.0804 0.0951 0.0895 0.0984 0.1006 0.1001 0.0946 0.0969 0.1302 0.1245 0.1144 0.1424 0.1413 0.1571 0.1471 0.1455 0.1554 0.1579 0.1588 0.1575
va: 1.2694 1.2437 2.1309 2.0426 2.0709 3.7239 3.8612 3.8512 3.9064 3.9043 3.8901 4.1887 4.2099 3.8067 3.6336 3.9536 3.9141 3.7467 3.9202 4.0071 3.7035 4.0021 3.8933 3.8880 3.8982 3.9040 1.0481 1.0339 1.0055 1.0016 1.0011 0.9989 1.0199 1.0007 1.0173 0.9952 1.0108 1.0088 1.0150 0.9900 1.0051 1.0083 0.9976 0.9889 0.9905 0.9907
dispcorr: -0.021570294 hartree
energy: -1958.471468706056
dipole: -22.52577 22.63644 0.11067 26.42731 -24.98353 1.44378 20.83908 -20.09846 0.74061
magnitude: 1.62642 au
magnitude: 4.13404 debye
