program: Orca
programVersion: 5.0.3
elementType: Cl Cl O O O C C C C C C C C C C C C C C C C C C C C C H H H H H H H H H H H H H H H H H H H H
charge: 0
multiplicity: 1
keywords: wb97x-d3
keywords: def2-TZVPP
keywords: def2/J RIJCOSX
keywords: DEFGRID2
keywords: scfconv7
keywords: smallprint printgap noloewdin
keywords: NOSOSCF
formula: C21H20Cl2O3
InChI: InChI=1/C21H20Cl2O3/c1-21(2)17(12-18(22)23)19(21)20(24)25-13-14-7-6-10-16(11-14)26-15-8-4-3-5-9-15/h3-12,17,19H,13H2,1-2H3
46 atoms
Cl 2.363496 -0.039835 -2.606936
Cl 4.479542 0.491297 -0.720795
O  -1.751879 -1.90074 1.404933
O  -1.560348 -2.394091 -0.764371
O  -2.295256 3.10136 0.268425
C  1.229961 -3.515908 0.122395
C  1.386906 -2.1538 -0.485902
C  0.382346 -2.370194 0.635948
C  2.275063 -4.036454 1.080701
C  0.632791 -4.604036 -0.735592
C  2.568744 -1.32214 -0.239684
C  -1.054952 -2.236391 0.320235
C  3.061846 -0.421506 -1.080545
C  -3.1494 -1.643125 1.235244
C  -3.40164 -0.393938 0.438904
C  -2.70743 0.770981 0.750122
C  -4.329892 -0.392136 -0.59395
C  -2.926128 1.920559 0.004266
C  -4.564752 0.773228 -1.310292
C  -3.858143 1.930213 -1.026451
C  -1.028818 3.120156 0.786415
C  -0.016595 2.299793 0.301324
C  -0.770679 4.048222 1.784967
C  1.256495 2.408439 0.840817
C  0.511806 4.15509 2.304545
C  1.528024 3.33121 1.842131
H  0.935876 -2.045588 -1.465615
H  0.665733 -1.995569 1.613041
H  1.866901 -4.86271 1.665346
H  3.141948 -4.414519 0.535498
H  2.624791 -3.285311 1.788054
H  1.435277 -5.162615 -1.220929
H  0.063058 -5.309961 -0.128212
H  -0.020344 -4.22698 -1.518664
H  3.093531 -1.445093 0.700168
H  -3.648964 -2.502263 0.783136
H  -3.529068 -1.536718 2.251615
H  -1.998255 0.775803 1.56921
H  -4.863511 -1.300542 -0.844317
H  -5.287842 0.776006 -2.115665
H  -4.02447 2.835135 -1.597376
H  -0.209444 1.585341 -0.48936
H  -1.568008 4.685175 2.147368
H  2.045029 1.769693 0.466256
H  0.710899 4.882556 3.080843
H  2.525502 3.409977 2.253934
elementType: Cl O C H
totalener: -1958.44981935 hartree
nucrepener: 2613.78135839 hartree
electener: -4572.23117775 hartree
oneelecener: -7881.39075348 hartree
twoeener: 3309.15957573 hartree
cpcmener: -0.02551065 hartree
kineticenergy: 1952.56883053 hartree
xcener: -143.509385545485 hartree
chargesum: -0.0000000
charge: -0.058296 -0.070844 -0.289514 -0.459902 -0.329045 0.085919 0.032958 -0.062488 -0.275964 -0.267906 -0.222716 0.386941 0.068696 0.102188 0.033312 -0.251772 -0.225243 0.295733 -0.106911 -0.261446 0.312407 -0.243405 -0.262416 -0.077730 -0.098793 -0.227148 0.079832 0.096663 0.098610 0.103138 0.092574 0.096257 0.099308 0.094908 0.128382 0.113867 0.124076 0.139905 0.141235 0.156678 0.145525 0.146883 0.145066 0.159658 0.156886 0.153931
qa: -0.0583 -0.0708 -0.2895 -0.4599 -0.3290 0.0859 0.0330 -0.0625 -0.2760 -0.2679 -0.2227 0.3869 0.0687 0.1022 0.0333 -0.2518 -0.2252 0.2957 -0.1069 -0.2614 0.3124 -0.2434 -0.2624 -0.0777 -0.0988 -0.2271 0.0798 0.0967 0.0986 0.1031 0.0926 0.0963 0.0993 0.0949 0.1284 0.1139 0.1241 0.1399 0.1412 0.1567 0.1455 0.1469 0.1451 0.1597 0.1569 0.1539
va: 1.2634 1.2311 2.1192 2.0478 2.0850 3.7694 3.8289 3.8013 3.9136 3.9019 3.9236 4.1870 4.1796 3.7983 3.6318 3.9265 3.9632 3.7145 3.8927 4.0111 3.6971 3.9480 4.0208 3.7896 3.8676 3.9729 1.0512 1.0318 1.0011 0.9999 1.0051 0.9999 0.9993 1.0203 1.0197 1.0083 0.9918 1.0160 1.0042 0.9891 1.0073 1.0076 1.0085 0.9885 0.9888 0.9949
dispcorr: -0.025147966 hartree
energy: -1958.474967319785
dipole: -14.56333 14.72496 0.16163 -16.89502 15.72029 -1.17473 13.78477 -12.23545 1.54932
magnitude: 1.95102 au
magnitude: 4.95911 debye
