program: Orca
programVersion: 5.0.3
elementType: Cl Cl O O O C C C C C C C C C C C C C C C C C C C C C H H H H H H H H H H H H H H H H H H H H
charge: 0
multiplicity: 1
keywords: wb97x-d3
keywords: def2-TZVPP
keywords: def2/J RIJCOSX
keywords: DEFGRID2
keywords: scfconv7
keywords: smallprint printgap noloewdin
keywords: NOSOSCF
formula: C21H20Cl2O3
InChI: InChI=1/C21H20Cl2O3/c1-21(2)17(12-18(22)23)19(21)20(24)25-13-14-7-6-10-16(11-14)26-15-8-4-3-5-9-15/h3-12,17,19H,13H2,1-2H3
46 atoms
Cl 3.150446 -0.017403 -2.348367
Cl 4.596228 0.617472 0.067192
O  -1.887744 -2.122191 1.091242
O  -1.490734 -2.117883 -1.106063
O  -2.607438 2.947043 0.833787
C  1.256063 -3.34067 -0.183758
C  1.423847 -1.880802 -0.497143
C  0.324165 -2.326177 0.44625
C  2.224375 -4.017446 0.755801
C  0.782492 -4.245787 -1.294274
C  2.537806 -1.094789 0.046845
C  -1.085424 -2.180002 0.028721
C  3.316261 -0.281433 -0.654973
C  -3.281282 -1.920908 0.854507
C  -3.586019 -0.546228 0.327599
C  -2.915264 0.563222 0.829204
C  -4.572715 -0.376595 -0.636823
C  -3.223242 1.827413 0.345994
C  -4.89121 0.89508 -1.089444
C  -4.212285 2.004834 -0.61034
C  -1.247724 2.969761 0.977048
C  -0.73994 3.691864 2.048234
C  -0.392058 2.355633 0.070241
C  0.6334 3.80058 2.210649
C  0.978685 2.470887 0.24897
C  1.500056 3.188521 1.316407
H  1.084576 -1.593096 -1.485758
H  0.498242 -2.144351 1.500946
H  3.142978 -4.286521 0.230805
H  2.497522 -3.399049 1.610167
H  1.786729 -4.937081 1.148442
H  0.19158 -3.730779 -2.048007
H  1.646929 -4.681715 -1.79898
H  0.184386 -5.068935 -0.897967
H  2.747145 -1.174633 1.107017
H  -3.675257 -2.688837 0.185297
H  -3.744852 -2.066308 1.830869
H  -2.155059 0.447313 1.592876
H  -5.091321 -1.239378 -1.03619
H  -5.660857 1.024016 -1.839151
H  -4.443529 2.997983 -0.974136
H  -1.417072 4.169566 2.744846
H  -0.779898 1.798839 -0.77349
H  1.024861 4.367297 3.045432
H  1.640712 2.002968 -0.466479
H  2.570641 3.272601 1.447349
elementType: Cl O C H
totalener: -1958.45024062 hartree
nucrepener: 2610.31136919 hartree
electener: -4568.76160981 hartree
oneelecener: -7874.45356147 hartree
twoeener: 3305.69195166 hartree
cpcmener: -0.02544707 hartree
kineticenergy: 1952.57846578 hartree
xcener: -143.510706404272 hartree
chargesum: -0.0000000
charge: -0.062429 -0.061619 -0.290557 -0.458788 -0.332387 0.089581 0.038724 -0.072338 -0.262078 -0.270133 -0.208450 0.386284 0.039109 0.106220 0.030635 -0.217852 -0.215094 0.246808 -0.118321 -0.239774 0.290249 -0.254505 -0.187628 -0.115263 -0.154352 -0.196646 0.082698 0.094229 0.100827 0.089430 0.098595 0.095056 0.096163 0.100722 0.131806 0.115377 0.121753 0.142932 0.140911 0.157244 0.146906 0.145141 0.150672 0.156912 0.174362 0.148866
qa: -0.0624 -0.0616 -0.2906 -0.4588 -0.3324 0.0896 0.0387 -0.0723 -0.2621 -0.2701 -0.2085 0.3863 0.0391 0.1062 0.0306 -0.2179 -0.2151 0.2468 -0.1183 -0.2398 0.2902 -0.2545 -0.1876 -0.1153 -0.1544 -0.1966 0.0827 0.0942 0.1008 0.0894 0.0986 0.0951 0.0962 0.1007 0.1318 0.1154 0.1218 0.1429 0.1409 0.1572 0.1469 0.1451 0.1507 0.1569 0.1744 0.1489
va: 1.2595 1.2405 2.1204 2.0459 2.0728 3.7483 3.8315 3.8373 3.9102 3.9031 3.8862 4.1741 4.1861 3.7929 3.6170 3.9315 3.9641 3.7429 3.8952 4.0144 3.6904 4.0111 3.8948 3.9064 3.8555 3.9270 1.0464 1.0351 1.0008 1.0054 1.0015 1.0199 1.0004 0.9992 1.0178 1.0090 0.9916 1.0158 1.0033 0.9891 1.0053 1.0085 1.0053 0.9890 0.9767 1.0006
dispcorr: -0.025460211 hartree
energy: -1958.475700831887
dipole: -17.47852 17.33917 -0.13935 -16.79952 15.41859 -1.38093 7.71907 -6.53090 1.18817
magnitude: 1.82706 au
magnitude: 4.64402 debye
