program: Gaussian 09
title: 000074894
version: EM64L-G09RevD.01
frameworkgroup: C1[X(C11H14Cl2N2O)]
method: RPBEPBE
basis: SDD
operation: Freq
keyword: #p
keyword: freq=noraman
keyword: PBEPBE/SDD
title: #p freq=noraman PBEPBE/SDD
converged: NO YES NO NO
title: Mulliken charges:
elementType: Cl Cl O N N C C C C C C C C C C C H H H H H H H H H H H H H H
charge: -0.054279 -0.052026 -0.285935 -0.168841 -0.642567 -0.391005 -0.389867 0.464211 -0.382850 -0.359177 -0.584527 -0.583788 0.317084 -0.351214 -0.404827 0.146348 0.250934 0.249971 0.249005 0.252868 0.233619 0.235790 0.293057 0.270435 0.294805 0.268362 0.196177 0.279224 0.313432 0.335582
chargesum: 0.00000
title: Mulliken charges with hydrogens summed into heavy atoms:
elementType: Cl Cl O N N C C C C C C C C C C C
charge: -0.054279 -0.052026 -0.285935 -0.168841 0.006447 0.109900 0.112005 0.464211 -0.149231 -0.123387 -0.021035 -0.020621 0.317084 -0.155037 -0.125602 0.146348
polarizability: 2.42351467e+02 6.99062553e-01 1.75332524e+02 5.47928623e-01 2.05066951e+01 8.70054125e+01
1716.lowfreq: -18.5623 -3.7885 -0.0022 -0.0021 -0.0016 1.6428 10.3322 30.9396 36.0497
frequency: -18.5541 30.9248 36.0353 41.5919 57.6252 91.0220 123.0668 134.0559 168.8904 202.1134 213.0837 243.8423 249.6595 307.0993 318.3656 373.2652 401.1180 446.6735 453.6555 476.3622 505.8667 537.2654 563.0987 572.1731 633.1239 653.4126 688.9378 690.3530 701.2821 755.6420 781.0520 786.5801 792.8953 805.1500 841.9247 930.9656 953.9748 994.3736 996.2635 1000.2505 1035.5088 1036.2452 1041.4060 1042.9920 1120.7044 1127.3424 1146.2814 1185.7267 1216.0832 1223.2860 1258.9603 1259.3181 1280.0397 1294.7351 1320.8689 1353.8804 1355.9545 1358.6794 1374.8805 1392.0196 1436.1147 1460.8635 1461.0669 1485.9869 1505.4988 1520.0113 1549.3527 1588.0043 1625.0150 1632.6238 3017.2373 3022.2649 3064.1809 3064.8140 3073.0319 3078.6403 3119.4181 3147.3885 3149.2614 3149.5879 3160.9942 3168.2409 3534.9640 3688.3011
redmass: 4.4526 13.6000 9.9845 9.0631 3.7270 3.6861 3.5396 2.5436 4.8605 13.0086 4.3327 4.3245 4.4918 4.0049 4.2495 4.6938 2.3093 2.3267 1.7148 3.7979 2.2249 4.2121 4.2505 1.2818 7.0889 5.3711 3.5536 4.0951 4.9900 4.1307 4.7889 1.1470 1.1596 1.4098 1.6486 1.4091 2.9285 1.4168 2.8717 1.4270 4.1808 2.1556 2.1271 2.0167 1.5915 2.2116 1.4937 1.5907 1.3076 1.7658 1.1621 1.1572 1.3342 1.1837 1.3502 1.5600 1.8281 1.6812 5.3148 1.8770 3.6090 1.0969 1.0974 1.0910 1.1298 2.5352 5.7268 2.6343 3.6631 2.3628 1.0601 1.0609 1.0576 1.0580 1.1026 1.1036 1.0882 1.0914 1.1085 1.1107 1.0934 1.0958 1.0447 1.1037
irintensity: 16.0660 1.0737 1.1256 1.9014 0.5985 0.8590 1.2003 1.5845 7.4537 1.6081 1.1949 14.7731 2.1758 4.9621 0.5196 13.0406 18.3876 20.5996 53.4573 11.8201 98.6767 32.9241 10.0641 53.6127 5.5317 43.2729 80.9784 27.6721 63.5106 38.8779 2.3847 3.3442 12.0104 11.0320 42.8727 0.6385 27.2482 1.4944 0.5870 4.2382 0.7037 0.1183 5.4135 0.0756 33.6596 14.3621 11.7669 71.6366 61.7470 34.2340 17.6627 13.0711 47.9613 6.0078 3.7144 160.6609 269.0781 9.4744 40.2215 131.3611 16.4863 8.1372 12.6101 27.2613 0.2514 174.9833 66.9638 133.0410 248.7370 297.2316 23.4002 15.7701 10.2560 18.7460 10.1533 8.2911 26.7307 5.7326 6.2207 14.8597 22.0150 11.9020 44.7871 29.6535
temp: 298.150 k
press: 1.00000 atm
elementType: 17 17 8 7 7 6 6 6 6 6 6 6 6 6 6 6 1 1 1 1 1 1 1 1 1 1 1 1 1 1
symmnumber: 1
zpe: 620149.0 jmol-1
zpe.correction: 0.236202 hartree
zpe.thermalcorrener: 0.251949 hartree
zpe.thermalcorrenthalpy: 0.252893 hartree
zpe.thermalcorrgfe: 0.190409 hartree
zpe.sumelectzpe: -1531.233577 hartree
zpe.sumelectthermal: -1531.217830 hartree
zpe.sumelectthermalent: -1531.216886 hartree
zpe.sumelectthermalfe: -1531.279370 hartree
dipole: -1.3852 3.3888 1.2776
dipole: 3.8775
quadrupole: -121.9284 -121.5378 -109.1031
quadrupole: 19.5757 7.4452 1.6850
quadrupole: -4.4053 -4.0147 8.4200 19.5757 7.4452 1.6850
hfenergy: -1531.4697792 hartree
pointgroup: C01 [X(C11H14Cl2N2O1)]
dipole: 0.5613824 1.3297239 -0.493847 debye
polarizability: 242.3222035|-1.2970187|175.535812|1.1203946|-20.1228694|86.8313885 unknown
InChI: InChI=1S/C11H14Cl2N2O/c12-5-7-15(8-6-13)10-3-1-9(2-4-10)11(14)16/h1-4H,5-8,14H2
charge 0 multiplicity 1
30 atoms
Cl 3.685655 3.701581 0.080975
Cl 3.6983 -3.675721 -0.077117
O  -4.602318 -1.117812 0.38579
N  1.791746 0.009673 -0.000302
N  -4.719523 1.049291 -0.407812
C  2.566301 1.18357 -0.440537
C  2.554991 -1.170711 0.444779
C  0.381922 0.01523 -0.0051
C  -0.354447 1.175711 -0.399892
C  -0.368321 -1.139162 0.385024
C  2.727789 2.197775 0.708061
C  2.719028 -2.185986 -0.702431
C  -2.500928 0.026489 -0.018005
C  -1.760389 1.171911 -0.407577
C  -1.770356 -1.122664 0.379322
C  -3.9990 -0.063323 0.007452
H  3.565793 0.854008 -0.774399
H  2.089079 1.669501 -1.309662
H  3.554315 -0.847369 0.785392
H  2.06839 -1.653478 1.310187
H  0.162902 2.090986 -0.700949
H  0.138694 -2.058129 0.692571
H  1.763334 2.582082 1.069112
H  3.317242 1.79208 1.543531
H  1.756727 -2.582482 -1.055877
H  3.298559 -1.775543 -1.542649
H  -2.262188 2.095959 -0.719679
H  -2.34179 -2.007122 0.680033
H  -4.28922 1.911139 -0.732631
H  -5.735887 0.981016 -0.389513
