program: Orca
programVersion: 5.0.3
elementType: Cl Cl O O O C C C C C C C C C C C C C C C C C C C C C H H H H H H H H H H H H H H H H H H H H
charge: 0
multiplicity: 1
keywords: wb97x-d3
keywords: def2-TZVPP
keywords: def2/J RIJCOSX
keywords: DEFGRID2
keywords: scfconv7
keywords: smallprint printgap noloewdin
keywords: NOSOSCF
formula: C21H20Cl2O3
InChI: InChI=1/C21H20Cl2O3/c1-21(2)17(12-18(22)23)19(21)20(24)25-13-14-7-6-10-16(11-14)26-15-8-4-3-5-9-15/h3-12,17,19H,13H2,1-2H3
46 atoms
Cl 0.820362 -0.087954 -1.091476
Cl 3.645829 0.287154 -0.603643
O  -1.723969 -2.505259 0.901432
O  -1.584998 -3.230854 -1.210898
O  -1.541606 2.66186 1.566805
C  1.217118 -4.382158 -0.277716
C  1.354606 -3.056898 -0.939201
C  0.35365 -3.225287 0.192499
C  2.277199 -4.82209 0.70222
C  0.618001 -5.521608 -1.062965
C  2.497221 -2.140895 -0.739429
C  -1.068681 -3.020061 -0.139434
C  2.348831 -0.824485 -0.802784
C  -2.984681 -1.86091 0.659398
C  -2.728218 -0.465396 0.166343
C  -2.260003 0.490975 1.061338
C  -2.864377 -0.139119 -1.177954
C  -1.942376 1.765965 0.617889
C  -2.542879 1.138966 -1.612201
C  -2.082164 2.099321 -0.724884
C  -0.71231 3.696709 1.220036
C  0.502303 3.466441 0.586296
C  -1.097538 4.980864 1.571081
C  1.325777 4.541264 0.288873
C  -0.257509 6.047134 1.279052
C  0.950089 5.833844 0.630222
H  0.892402 -2.986694 -1.920344
H  0.650419 -2.802532 1.145342
H  2.66733 -3.997168 1.298951
H  1.874914 -5.564138 1.393739
H  3.117216 -5.281059 0.17724
H  0.111773 -6.225124 -0.399591
H  -0.097284 -5.193967 -1.813839
H  1.408873 -6.068432 -1.579954
H  3.486453 -2.541566 -0.55008
H  -3.597888 -2.432748 -0.037283
H  -3.487361 -1.854033 1.625361
H  -2.14349 0.247805 2.111482
H  -3.218969 -0.877858 -1.884761
H  -2.652871 1.396848 -2.657495
H  -1.846291 3.093487 -1.082129
H  0.807261 2.459919 0.330169
H  -2.044237 5.143576 2.070933
H  2.270375 4.362645 -0.208624
H  -0.556962 7.050012 1.553488
H  1.597695 6.668181 0.395874
elementType: Cl O C H
totalener: -1958.44529745 hartree
nucrepener: 2638.34710072 hartree
electener: -4596.79239817 hartree
oneelecener: -7931.10580429 hartree
twoeener: 3334.31340612 hartree
cpcmener: -0.02319191 hartree
kineticenergy: 1952.58983586 hartree
xcener: -143.510904289630 hartree
chargesum: -0.0000000
charge: -0.054762 -0.057777 -0.282329 -0.461936 -0.327679 0.139773 -0.047155 -0.090499 -0.279509 -0.267308 -0.215120 0.363048 0.089111 0.091354 -0.002318 -0.265042 -0.169816 0.276628 -0.162118 -0.184394 0.232090 -0.143099 -0.210348 -0.167502 -0.141470 -0.159875 0.111138 0.104315 0.091688 0.098471 0.101549 0.098638 0.091938 0.094261 0.141435 0.111634 0.121446 0.130019 0.140601 0.156973 0.151717 0.137627 0.145711 0.154165 0.156926 0.157802
qa: -0.0548 -0.0578 -0.2823 -0.4619 -0.3277 0.1398 -0.0472 -0.0905 -0.2795 -0.2673 -0.2151 0.3630 0.0891 0.0914 -0.0023 -0.2650 -0.1698 0.2766 -0.1621 -0.1844 0.2321 -0.1431 -0.2103 -0.1675 -0.1415 -0.1599 0.1111 0.1043 0.0917 0.0985 0.1015 0.0986 0.0919 0.0943 0.1414 0.1116 0.1214 0.1300 0.1406 0.1570 0.1517 0.1376 0.1457 0.1542 0.1569 0.1578
va: 1.3101 1.2510 2.1097 2.0373 2.0714 3.7370 3.8761 3.7923 3.9132 3.8808 3.9095 4.2075 4.1664 3.8055 3.6638 4.0617 3.9014 3.7081 3.9181 3.8699 3.7332 3.8827 3.9849 3.9244 3.8893 3.8873 1.0298 1.0280 0.9995 1.0033 0.9992 0.9996 1.0200 1.0011 1.0080 1.0135 0.9965 1.0212 1.0136 0.9924 1.0001 1.0272 1.0065 0.9936 0.9898 0.9901
dispcorr: -0.026301577 hartree
energy: -1958.471599030497
dipole: -6.56315 7.26240 0.69926 -14.66588 14.28542 -0.38046 3.17124 -2.83867 0.33258
magnitude: 0.86274 au
magnitude: 2.19291 debye
