program: Orca
programVersion: 5.0.3
elementType: Cl Cl O O O C C C C C C C C C C C C C C C C C C C C C H H H H H H H H H H H H H H H H H H H H
charge: 0
multiplicity: 1
keywords: wb97x-d3
keywords: def2-TZVPP
keywords: def2/J RIJCOSX
keywords: DEFGRID2
keywords: scfconv7
keywords: smallprint printgap noloewdin
keywords: NOSOSCF
formula: C21H20Cl2O3
InChI: InChI=1/C21H20Cl2O3/c1-21(2)17(12-18(22)23)19(21)20(24)25-13-14-7-6-10-16(11-14)26-15-8-4-3-5-9-15/h3-12,17,19H,13H2,1-2H3
46 atoms
Cl 2.364039 -5.236513 -1.003379
Cl 4.946346 -4.226648 -1.796784
O  -0.619176 0.330153 -1.929743
O  -1.198188 -1.666987 -1.110581
O  -2.470266 2.66773 2.241318
C  1.477146 -1.081064 0.502332
C  1.657049 -2.211393 -0.473768
C  1.067842 -0.901341 -0.945853
C  2.665413 -0.270941 0.959438
C  0.431621 -1.252909 1.576919
C  2.980133 -2.60882 -0.967659
C  -0.358235 -0.827926 -1.324125
C  3.366169 -3.853309 -1.218969
C  -1.985019 0.633331 -2.214416
C  -2.775179 0.909919 -0.965447
C  -2.225315 1.688344 0.04894
C  -4.063113 0.407196 -0.830096
C  -2.97421 1.963149 1.185044
C  -4.802576 0.692389 0.309049
C  -4.266589 1.472674 1.320459
C  -1.644045 3.739233 2.04308
C  -0.604485 3.905553 2.948419
C  -1.854816 4.666998 1.029411
C  0.228222 5.010045 2.838558
C  -1.005722 5.759406 0.924303
C  0.037004 5.937934 1.823945
H  0.938541 -3.015555 -0.362995
H  1.719664 -0.253632 -1.521766
H  3.200812 -0.787181 1.758876
H  3.376499 -0.06218 0.160913
H  2.331314 0.69111 1.352852
H  0.003631 -0.288996 1.861773
H  -0.383967 -1.9102 1.282638
H  0.892395 -1.684644 2.467662
H  3.709575 -1.829112 -1.152905
H  -1.939708 1.523626 -2.842455
H  -2.448265 -0.162145 -2.801562
H  -1.216097 2.072073 -0.044133
H  -4.486073 -0.212849 -1.610715
H  -5.805098 0.298521 0.414673
H  -4.839034 1.69484 2.212358
H  -0.455304 3.178104 3.736659
H  -2.671777 4.548891 0.328675
H  1.034827 5.13947 3.548741
H  -1.169885 6.480351 0.133675
H  0.691938 6.794756 1.736398
elementType: Cl O C H
totalener: -1958.45030463 hartree
nucrepener: 2489.93503737 hartree
electener: -4448.38534200 hartree
oneelecener: -7633.55870413 hartree
twoeener: 3185.17336213 hartree
cpcmener: -0.02637368 hartree
kineticenergy: 1952.56355377 hartree
xcener: -143.507341005032 hartree
chargesum: -0.0000000
charge: -0.056625 -0.062232 -0.286985 -0.450724 -0.332572 0.094015 0.022205 -0.066822 -0.268190 -0.265911 -0.201652 0.374310 0.041241 0.101407 0.046836 -0.261387 -0.226648 0.301101 -0.107876 -0.259211 0.295961 -0.258210 -0.197288 -0.116424 -0.142188 -0.189892 0.077195 0.096522 0.101158 0.091176 0.096642 0.092854 0.095660 0.101994 0.127806 0.121526 0.115472 0.137362 0.141426 0.157119 0.146067 0.145040 0.154559 0.157555 0.158940 0.157685
qa: -0.0566 -0.0622 -0.2870 -0.4507 -0.3326 0.0940 0.0222 -0.0668 -0.2682 -0.2659 -0.2017 0.3743 0.0412 0.1014 0.0468 -0.2614 -0.2266 0.3011 -0.1079 -0.2592 0.2960 -0.2582 -0.1973 -0.1164 -0.1422 -0.1899 0.0772 0.0965 0.1012 0.0912 0.0966 0.0929 0.0957 0.1020 0.1278 0.1215 0.1155 0.1374 0.1414 0.1571 0.1461 0.1450 0.1546 0.1576 0.1589 0.1577
va: 1.2692 1.2426 2.1150 2.0582 2.0637 3.7356 3.8881 3.7956 3.9055 3.9025 3.9031 4.2378 4.2108 3.7976 3.6162 3.9114 3.9758 3.6812 3.8888 4.0217 3.6858 4.0018 3.9121 3.8818 3.8908 3.9102 1.0509 1.0327 1.0007 1.0056 1.0024 1.0013 1.0183 1.0013 1.0197 0.9921 1.0090 1.0196 1.0035 0.9890 1.0067 1.0092 0.9984 0.9890 0.9902 0.9907
dispcorr: -0.022993662 hartree
energy: -1958.473298290728
dipole: -17.21754 17.45489 0.23735 33.81885 -31.82050 1.99835 13.68035 -13.86274 -0.18239
magnitude: 2.02064 au
magnitude: 5.13606 debye
