program: Orca
programVersion: 5.0.3
elementType: Cl Cl O O O C C C C C C C C C C C C C C C C C C C C C H H H H H H H H H H H H H H H H H H H H
charge: 0
multiplicity: 1
keywords: wb97x-d3
keywords: def2-TZVPP
keywords: def2/J RIJCOSX
keywords: DEFGRID2
keywords: scfconv7
keywords: smallprint printgap noloewdin
keywords: NOSOSCF
formula: C21H20Cl2O3
InChI: InChI=1/C21H20Cl2O3/c1-21(2)17(12-18(22)23)19(21)20(24)25-13-14-7-6-10-16(11-14)26-15-8-4-3-5-9-15/h3-12,17,19H,13H2,1-2H3
46 atoms
Cl 2.850527 -1.755514 2.607449
Cl 2.515854 -4.585352 3.056276
O  -1.47033 -1.60155 -1.66736
O  0.209252 -0.131009 -1.525801
O  -2.644742 3.766829 0.556058
C  2.065481 -2.612215 -1.756837
C  1.797186 -2.385228 -0.298345
C  0.637987 -2.475043 -1.280085
C  2.472805 -3.985713 -2.237172
C  2.7449 -1.505628 -2.527109
C  1.95295 -3.441386 0.708167
C  -0.186221 -1.264975 -1.502889
C  2.382632 -3.272254 1.952985
C  -2.40185 -0.531134 -1.803335
C  -2.548439 0.269772 -0.539344
C  -2.51014 1.65398 -0.600127
C  -2.735255 -0.364059 0.684122
C  -2.642842 2.405511 0.560358
C  -2.872717 0.393598 1.835554
C  -2.821619 1.77757 1.783827
C  -1.830492 4.471226 -0.28159
C  -2.316868 5.687913 -0.740652
C  -0.552963 4.047682 -0.629588
C  -1.520979 6.484545 -1.547752
C  0.226719 4.851595 -1.447045
C  -0.248356 6.069421 -1.91026
H  2.006851 -1.378894 0.045526
H  0.070433 -3.398503 -1.255922
H  1.922326 -4.793488 -1.756013
H  2.29902 -4.074042 -3.310472
H  3.535592 -4.154966 -2.057476
H  2.448816 -1.528851 -3.577397
H  2.521061 -0.516239 -2.139822
H  3.8259 -1.648852 -2.485879
H  1.68845 -4.45384 0.429302
H  -2.122675 0.117268 -2.63713
H  -3.34085 -1.022462 -2.060751
H  -2.353863 2.144061 -1.55317
H  -2.764371 -1.444542 0.742517
H  -3.012434 -0.097163 2.789597
H  -2.918169 2.373397 2.681706
H  -3.31222 6.003833 -0.456932
H  -0.165043 3.100507 -0.277124
H  -1.904079 7.433186 -1.900078
H  1.219604 4.517823 -1.718058
H  0.368663 6.690121 -2.545552
totalener: -1958.42565649 hartree
nucrepener: 2489.58834521 hartree
electener: -4448.01400170 hartree
oneelecener: -7632.49101288 hartree
twoeener: 3184.47701118 hartree
kineticenergy: 1952.62489302 hartree
xcener: -143.515908598983 hartree
chargesum: -0.0000000
charge: -0.039724 -0.048489 -0.274217 -0.383935 -0.298689 0.080416 0.034619 -0.079719 -0.250767 -0.247138 -0.202487 0.348804 0.049604 0.072093 0.050798 -0.180940 -0.233319 0.254199 -0.066486 -0.223578 0.278329 -0.229820 -0.187086 -0.082517 -0.110175 -0.153806 0.087937 0.075716 0.072593 0.092971 0.099199 0.084619 0.103391 0.085735 0.094542 0.100100 0.110133 0.116182 0.116524 0.124934 0.124098 0.122465 0.139497 0.123154 0.127605 0.122637
qa: -0.0397 -0.0485 -0.2742 -0.3839 -0.2987 0.0804 0.0346 -0.0797 -0.2508 -0.2471 -0.2025 0.3488 0.0496 0.0721 0.0508 -0.1809 -0.2333 0.2542 -0.0665 -0.2236 0.2783 -0.2298 -0.1871 -0.0825 -0.1102 -0.1538 0.0879 0.0757 0.0726 0.0930 0.0992 0.0846 0.1034 0.0857 0.0945 0.1001 0.1101 0.1162 0.1165 0.1249 0.1241 0.1225 0.1395 0.1232 0.1276 0.1226
va: 1.2882 1.2565 2.1245 2.1148 2.1146 3.7467 3.8425 3.8476 3.9107 3.9106 3.9249 4.2212 4.2488 3.8520 3.6678 3.9515 4.0200 3.8497 3.9218 4.0576 3.7815 4.0457 3.9384 3.9261 3.9421 3.9655 1.0474 1.0369 1.0097 1.0043 1.0023 1.0027 1.0258 1.0007 1.0319 1.0103 0.9876 1.0137 1.0180 0.9987 1.0135 1.0155 1.0067 0.9989 0.9993 1.0010
dispcorr: -0.022030277 hartree
energy: -1958.447686761926
dipole: -7.11490 6.98016 -0.13474 11.87649 -12.54262 -0.66613 -29.10798 28.16070 -0.94727
magnitude: 1.16585 au
magnitude: 2.96336 debye
